program: Orca
programVersion: 5.0.3
elementType: Cl Cl O O O C C C C C C C C C C C C C C C C C C C C C H H H H H H H H H H H H H H H H H H H H
charge: 0
multiplicity: 1
keywords: wb97x-d3
keywords: def2-TZVPP
keywords: def2/J RIJCOSX
keywords: DEFGRID2
keywords: scfconv7
keywords: smallprint printgap noloewdin
keywords: NOSOSCF
formula: C21H20Cl2O3
InChI: InChI=1/C21H20Cl2O3/c1-21(2)17(12-18(22)23)19(21)20(24)25-13-14-7-6-10-16(11-14)26-15-8-4-3-5-9-15/h3-12,17,19H,13H2,1-2H3
46 atoms
Cl 3.253804 -4.160387 1.430312
Cl 4.700037 -4.788348 -0.986189
O  -1.664663 -1.422607 -1.740622
O  -1.128714 -1.831082 0.389504
O  -2.038974 3.439124 -0.555174
C  1.59123 -0.622447 -0.74078
C  1.719372 -2.074316 -0.366325
C  0.590113 -1.632593 -1.267738
C  2.527626 -0.021914 -1.76058
C  1.200314 0.352594 0.342542
C  2.777723 -2.926217 -0.922002
C  -0.796119 -1.653831 -0.75651
C  3.475426 -3.828833 -0.244435
C  -3.034091 -1.250873 -1.375955
C  -3.262469 0.021389 -0.607298
C  -2.533777 1.168737 -0.905045
C  -4.217974 0.060735 0.399832
C  -2.762532 2.335184 -0.1933
C  -4.451786 1.240905 1.092203
C  -3.727898 2.386603 0.804925
C  -1.473865 4.22713 0.408413
C  -0.9569 3.707837 1.589758
C  -1.384438 5.585547 0.135766
C  -0.3637 4.566369 2.504433
C  -0.778529 6.42906 1.055282
C  -0.272773 5.927082 2.246275
H  1.422522 -2.301714 0.651038
H  0.686248 -1.856644 -2.324763
H  2.091248 0.885718 -2.18087
H  3.476221 0.252469 -1.295414
H  2.744474 -0.690294 -2.592715
H  0.671671 1.208514 -0.082034
H  0.569414 -0.084567 1.113583
H  2.096967 0.733775 0.834265
H  3.014733 -2.821998 -1.974255
H  -3.569433 -1.226253 -2.32542
H  -3.398545 -2.113511 -0.814717
H  -1.781214 1.168534 -1.68468
H  -4.777283 -0.832364 0.649924
H  -5.200815 1.26816 1.872799
H  -3.91351 3.302461 1.351749
H  -1.009449 2.647239 1.80214
H  -1.785091 5.976586 -0.791031
H  0.035063 4.160592 3.425079
H  -0.711864 7.48756 0.839309
H  0.190852 6.589237 2.965368
elementType: Cl O C H
totalener: -1958.45004919 hartree
nucrepener: 2493.60391260 hartree
electener: -4452.05396178 hartree
oneelecener: -7640.95358563 hartree
twoeener: 3188.89962385 hartree
cpcmener: -0.02591535 hartree
kineticenergy: 1952.57472429 hartree
xcener: -143.509916467546 hartree
chargesum: -0.0000000
charge: -0.056276 -0.061939 -0.286748 -0.448606 -0.333177 0.101827 0.023359 -0.065031 -0.266776 -0.274642 -0.202980 0.366266 0.040478 0.096609 0.052504 -0.302013 -0.213849 0.271477 -0.127032 -0.190668 0.303239 -0.194259 -0.250137 -0.161204 -0.124002 -0.183615 0.076712 0.098041 0.098426 0.101628 0.090645 0.088546 0.098572 0.105517 0.128709 0.122190 0.117055 0.134107 0.141259 0.158622 0.156661 0.153877 0.144296 0.157838 0.156811 0.157682
qa: -0.0563 -0.0619 -0.2867 -0.4486 -0.3332 0.1018 0.0234 -0.0650 -0.2668 -0.2746 -0.2030 0.3663 0.0405 0.0966 0.0525 -0.3020 -0.2138 0.2715 -0.1270 -0.1907 0.3032 -0.1943 -0.2501 -0.1612 -0.1240 -0.1836 0.0767 0.0980 0.0984 0.1016 0.0906 0.0885 0.0986 0.1055 0.1287 0.1222 0.1171 0.1341 0.1413 0.1586 0.1567 0.1539 0.1443 0.1578 0.1568 0.1577
va: 1.2696 1.2429 2.1183 2.0570 2.0573 3.7354 3.8937 3.8091 3.9027 3.8987 3.8981 4.2365 4.2096 3.7954 3.6108 4.0182 3.9801 3.7334 3.8938 3.9296 3.6587 3.8782 4.0100 3.9178 3.8914 3.9029 1.0518 1.0322 1.0022 1.0011 1.0055 1.0014 1.0171 1.0024 1.0187 0.9922 1.0091 1.0272 1.0032 0.9902 0.9955 0.9978 1.0089 0.9912 0.9893 0.9904
dispcorr: -0.023783365 hartree
energy: -1958.473832551755
dipole: -19.39764 18.86976 -0.52788 34.38561 -33.32647 1.05914 -1.23150 0.44308 -0.78841
magnitude: 1.42198 au
magnitude: 3.61438 debye
