program: Orca
programVersion: 5.0.3
elementType: Cl Cl O O O C C C C C C C C C C C C C C C C C C C C C H H H H H H H H H H H H H H H H H H H H
charge: 0
multiplicity: 1
keywords: wb97x-d3
keywords: def2-TZVPP
keywords: def2/J RIJCOSX
keywords: DEFGRID2
keywords: scfconv7
keywords: smallprint printgap noloewdin
keywords: NOSOSCF
formula: C21H20Cl2O3
InChI: InChI=1/C21H20Cl2O3/c1-21(2)17(12-18(22)23)19(21)20(24)25-13-14-7-6-10-16(11-14)26-15-8-4-3-5-9-15/h3-12,17,19H,13H2,1-2H3
46 atoms
Cl 3.330659 -4.256784 1.294637
Cl 4.714413 -4.805961 -1.177189
O  -1.649188 -1.456236 -1.670833
O  -1.062388 -1.866999 0.44648
O  -2.003275 3.388617 -0.474293
C  1.622018 -0.6317 -0.751992
C  1.778146 -2.084758 -0.391714
C  0.614793 -1.648021 -1.252087
C  2.513418 -0.009343 -1.798734
C  1.258137 0.327697 0.354604
C  2.817723 -2.92585 -0.99677
C  -0.757483 -1.68418 -0.70616
C  3.518385 -3.862518 -0.370441
C  -3.011657 -1.290057 -1.280931
C  -3.232702 -0.01966 -0.50701
C  -2.499999 1.124807 -0.801964
C  -4.192451 0.023142 0.496604
C  -2.726872 2.294283 -0.092805
C  -4.422352 1.204334 1.188063
C  -3.694193 2.349056 0.903463
C  -1.510074 4.264073 0.451744
C  -1.46572 5.601946 0.083057
C  -1.009381 3.851934 1.681304
C  -0.913879 6.532732 0.95096
C  -0.47038 4.796816 2.543459
C  -0.418787 6.137227 2.186024
H  1.520494 -2.321586 0.634391
H  0.682626 -1.866361 -2.312405
H  2.703989 -0.66466 -2.647573
H  2.051041 0.898579 -2.190292
H  3.476638 0.269795 -1.367446
H  0.700716 1.18013 -0.040151
H  0.663471 -0.12622 1.1447
H  2.167562 0.717615 0.815608
H  3.032737 -2.785969 -2.049562
H  -3.563279 -1.263942 -2.221453
H  -3.364709 -2.15576 -0.716549
H  -1.746836 1.123391 -1.581118
H  -4.75884 -0.866701 0.742694
H  -5.175394 1.235101 1.964906
H  -3.882652 3.264972 1.449121
H  -1.856248 5.908116 -0.879489
H  -1.030366 2.808369 1.969653
H  -0.878041 7.574291 0.658535
H  -0.08076 4.475093 3.500726
H  0.00673 6.866466 2.862645
elementType: Cl O C H
totalener: -1958.45001923 hartree
nucrepener: 2484.90791552 hartree
electener: -4443.35793475 hartree
oneelecener: -7623.57061874 hartree
twoeener: 3180.21268398 hartree
cpcmener: -0.02602688 hartree
kineticenergy: 1952.56441244 hartree
xcener: -143.508044098742 hartree
chargesum: -0.0000000
charge: -0.056129 -0.062174 -0.286583 -0.447564 -0.332007 0.100710 0.022864 -0.062736 -0.267216 -0.271634 -0.201088 0.363944 0.039216 0.096305 0.054817 -0.308574 -0.219804 0.289467 -0.125179 -0.204256 0.308470 -0.256991 -0.199590 -0.119844 -0.152355 -0.186243 0.076496 0.097451 0.090891 0.098100 0.101578 0.088976 0.097603 0.104963 0.127459 0.122078 0.117395 0.134168 0.141008 0.158535 0.155946 0.144423 0.154073 0.156860 0.158294 0.157875
qa: -0.0561 -0.0622 -0.2866 -0.4476 -0.3320 0.1007 0.0229 -0.0627 -0.2672 -0.2716 -0.2011 0.3639 0.0392 0.0963 0.0548 -0.3086 -0.2198 0.2895 -0.1252 -0.2043 0.3085 -0.2570 -0.1996 -0.1198 -0.1524 -0.1862 0.0765 0.0975 0.0909 0.0981 0.1016 0.0890 0.0976 0.1050 0.1275 0.1221 0.1174 0.1342 0.1410 0.1585 0.1559 0.1444 0.1541 0.1569 0.1583 0.1579
va: 1.2698 1.2424 2.1166 2.0582 2.0577 3.7354 3.8980 3.7991 3.9033 3.8993 3.8972 4.2401 4.2108 3.7948 3.6139 4.0200 3.9844 3.7240 3.8937 3.9331 3.6561 4.0163 3.8941 3.8874 3.9048 3.9054 1.0509 1.0325 1.0056 1.0020 1.0011 1.0016 1.0175 1.0023 1.0196 0.9920 1.0089 1.0277 1.0034 0.9901 0.9963 1.0092 0.9992 0.9894 0.9907 0.9905
dispcorr: -0.023499798 hartree
energy: -1958.473519028034
dipole: -19.85969 19.29056 -0.56913 35.07121 -33.90973 1.16148 -0.40512 -0.36606 -0.77118
magnitude: 1.50588 au
magnitude: 3.82764 debye
