program: Orca
programVersion: 5.0.3
elementType: Cl Cl O O O C C C C C C C C C C C C C C C C C C C C C H H H H H H H H H H H H H H H H H H H H
charge: 0
multiplicity: 1
keywords: wb97x-d3
keywords: def2-TZVPP
keywords: def2/J RIJCOSX
keywords: DEFGRID2
keywords: scfconv7
keywords: smallprint printgap noloewdin
keywords: NOSOSCF
formula: C21H20Cl2O3
InChI: InChI=1/C21H20Cl2O3/c1-21(2)17(12-18(22)23)19(21)20(24)25-13-14-7-6-10-16(11-14)26-15-8-4-3-5-9-15/h3-12,17,19H,13H2,1-2H3
46 atoms
Cl 3.646727 -0.245491 -1.964495
Cl 4.73271 0.558762 0.585709
O  -1.995253 -2.106873 1.01976
O  -1.41651 -1.833554 -1.122767
O  -2.540951 2.906537 0.692658
C  1.242199 -3.156368 -0.020642
C  1.440497 -1.688476 -0.278403
C  0.267848 -2.14751 0.554544
C  2.131975 -3.85578 0.976552
C  0.850101 -4.030205 -1.185242
C  2.523677 -0.942739 0.38031
C  -1.106755 -2.006699 0.02983
C  3.499755 -0.304395 -0.25061
C  -3.373459 -1.947937 0.701972
C  -3.737216 -0.534714 0.335912
C  -2.945684 0.538472 0.71908
C  -4.912559 -0.303572 -0.372658
C  -3.306644 1.827073 0.347139
C  -5.284709 0.991094 -0.696887
C  -4.477897 2.066613 -0.353033
C  -1.181732 2.849703 0.545032
C  -0.569227 2.170014 -0.502945
C  -0.421643 3.554767 1.468203
C  0.813537 2.19714 -0.610276
C  0.959926 3.57897 1.341909
C  1.585261 2.897088 0.307335
H  1.192612 -1.369238 -1.284966
H  0.351901 -1.995222 1.625018
H  1.657676 -4.774416 1.326392
H  3.083018 -4.127741 0.515191
H  2.350028 -3.247426 1.853808
H  1.747018 -4.44522 -1.649091
H  0.235088 -4.8688 -0.852281
H  0.302621 -3.49505 -1.958088
H  2.534719 -0.9086 1.463352
H  -3.67009 -2.63672 -0.092669
H  -3.901217 -2.248919 1.607858
H  -2.040768 0.384434 1.294123
H  -5.534893 -1.137494 -0.674258
H  -6.201648 1.166351 -1.244406
H  -4.749453 3.077549 -0.629178
H  -1.154284 1.622112 -1.230944
H  -0.912169 4.08347 2.276061
H  1.287053 1.671572 -1.429312
H  1.548022 4.130203 2.064376
H  2.663063 2.912283 0.214808
elementType: Cl O C H
totalener: -1958.44991561 hartree
nucrepener: 2632.66971404 hartree
electener: -4591.11962965 hartree
oneelecener: -7919.18766845 hartree
twoeener: 3328.06803880 hartree
cpcmener: -0.02531053 hartree
kineticenergy: 1952.57618636 hartree
xcener: -143.512515097827 hartree
chargesum: 0.0000000
charge: -0.058961 -0.059421 -0.290480 -0.451414 -0.331722 0.106247 -0.010618 -0.057000 -0.257542 -0.270997 -0.175600 0.365622 0.021738 0.092048 0.040668 -0.224446 -0.233151 0.266491 -0.114284 -0.247571 0.301278 -0.198005 -0.253071 -0.156490 -0.119216 -0.177274 0.089146 0.096210 0.099187 0.100849 0.088854 0.096423 0.101690 0.094105 0.136252 0.117405 0.126124 0.145989 0.141464 0.157098 0.145147 0.149547 0.143844 0.156539 0.156266 0.151031
qa: -0.0590 -0.0594 -0.2905 -0.4514 -0.3317 0.1062 -0.0106 -0.0570 -0.2575 -0.2710 -0.1756 0.3656 0.0217 0.0920 0.0407 -0.2244 -0.2332 0.2665 -0.1143 -0.2476 0.3013 -0.1980 -0.2531 -0.1565 -0.1192 -0.1773 0.0891 0.0962 0.0992 0.1008 0.0889 0.0964 0.1017 0.0941 0.1363 0.1174 0.1261 0.1460 0.1415 0.1571 0.1451 0.1495 0.1438 0.1565 0.1563 0.1510
va: 1.2633 1.2453 2.1214 2.0478 2.0794 3.7753 3.8414 3.8299 3.9054 3.9023 3.8196 4.1848 4.1822 3.8006 3.6050 3.9297 3.9808 3.7355 3.8879 4.0217 3.6774 3.8954 4.0151 3.8550 3.9162 3.8702 1.0384 1.0350 1.0023 1.0018 1.0041 1.0011 0.9994 1.0189 1.0133 1.0090 0.9905 1.0142 1.0016 0.9888 1.0061 1.0062 1.0088 0.9976 0.9893 1.0056
dispcorr: -0.026847889 hartree
energy: -1958.476763495102
dipole: -19.99137 19.60925 -0.38212 -15.61093 14.15679 -1.45414 4.64920 -3.55606 1.09314
magnitude: 1.85890 au
magnitude: 4.72494 debye
