program: Orca
programVersion: 5.0.3
elementType: Cl Cl O O O C C C C C C C C C C C C C C C C C C C C C H H H H H H H H H H H H H H H H H H H H
charge: 0
multiplicity: 1
keywords: wb97x-d3
keywords: def2-TZVPP
keywords: def2/J RIJCOSX
keywords: DEFGRID2
keywords: scfconv7
keywords: smallprint printgap noloewdin
keywords: NOSOSCF
formula: C21H20Cl2O3
InChI: InChI=1/C21H20Cl2O3/c1-21(2)17(12-18(22)23)19(21)20(24)25-13-14-7-6-10-16(11-14)26-15-8-4-3-5-9-15/h3-12,17,19H,13H2,1-2H3
46 atoms
Cl 3.05387 -0.921961 2.335054
Cl 3.015519 -3.637341 3.309137
O  -1.662152 -1.844184 -1.51056
O  -0.114361 -0.235312 -1.609129
O  -2.766454 3.583875 0.278828
C  1.891974 -2.632338 -1.689239
C  1.764602 -2.145944 -0.274958
C  0.516445 -2.48555 -1.076424
C  2.343727 -4.048459 -1.95734
C  2.393218 -1.654624 -2.723935
C  2.107169 -2.987479 0.876525
C  -0.412864 -1.391051 -1.425927
C  2.65096 -2.563734 2.010826
C  -2.704436 -0.888285 -1.743412
C  -2.89545 0.020004 -0.561887
C  -2.752839 1.391575 -0.712001
C  -3.193686 -0.509962 0.691216
C  -2.883693 2.225823 0.390575
C  -3.339098 0.333409 1.781111
C  -3.174483 1.705032 1.641637
C  -1.734632 4.127019 -0.435716
C  -1.979977 5.347823 -1.051293
C  -0.478318 3.535338 -0.516503
C  -0.961511 5.979072 -1.749961
C  0.527098 4.17482 -1.228312
C  0.29431 5.394498 -1.848787
H  1.937978 -1.08318 -0.148646
H  0.030175 -3.420064 -0.820075
H  1.890375 -4.780028 -1.289492
H  2.081617 -4.338006 -2.976441
H  3.427762 -4.131178 -1.859388
H  3.476439 -1.751221 -2.817488
H  1.958816 -1.868972 -3.702603
H  2.178334 -0.617425 -2.479487
H  1.894574 -4.047837 0.809768
H  -2.507721 -0.318347 -2.653379
H  -3.591923 -1.496111 -1.916242
H  -2.52235 1.803604 -1.68736
H  -3.312046 -1.579316 0.817928
H  -3.571212 -0.077769 2.755044
H  -3.271567 2.364587 2.494877
H  -2.961592 5.800123 -0.978124
H  -0.272857 2.587881 -0.03401
H  -1.157538 6.930887 -2.227096
H  1.503058 3.710232 -1.291875
H  1.084268 5.885407 -2.401958
elementType: Cl O C H
totalener: -1958.44945614 hartree
nucrepener: 2515.63904335 hartree
electener: -4474.08849949 hartree
oneelecener: -7685.51974460 hartree
twoeener: 3211.43124511 hartree
cpcmener: -0.02515298 hartree
kineticenergy: 1952.56068160 hartree
xcener: -143.505730109507 hartree
chargesum: 0.0000000
charge: -0.056025 -0.061634 -0.286697 -0.466671 -0.331775 0.093967 0.023111 -0.077147 -0.270065 -0.271326 -0.202168 0.403551 0.041998 0.096577 0.023384 -0.196592 -0.246538 0.268664 -0.113285 -0.242460 0.291709 -0.253624 -0.186368 -0.120281 -0.147806 -0.190821 0.082276 0.094022 0.091575 0.097530 0.101266 0.095810 0.098941 0.096201 0.126932 0.114753 0.126628 0.142080 0.141075 0.157631 0.146620 0.144147 0.149258 0.156931 0.158094 0.156551
qa: -0.0560 -0.0616 -0.2867 -0.4667 -0.3318 0.0940 0.0231 -0.0771 -0.2701 -0.2713 -0.2022 0.4036 0.0420 0.0966 0.0234 -0.1966 -0.2465 0.2687 -0.1133 -0.2425 0.2917 -0.2536 -0.1864 -0.1203 -0.1478 -0.1908 0.0823 0.0940 0.0916 0.0975 0.1013 0.0958 0.0989 0.0962 0.1269 0.1148 0.1266 0.1421 0.1411 0.1576 0.1466 0.1441 0.1493 0.1569 0.1581 0.1566
va: 1.2696 1.2431 2.1248 2.0377 2.0758 3.7251 3.8735 3.8298 3.9107 3.9015 3.9031 4.1656 4.2110 3.7991 3.6052 3.9216 3.9659 3.7261 3.8846 4.0225 3.6964 4.0027 3.8845 3.8860 3.8995 3.9077 1.0430 1.0337 1.0055 1.0014 1.0005 0.9999 0.9993 1.0209 1.0202 1.0085 0.9912 1.0094 1.0089 0.9887 1.0056 1.0089 1.0072 0.9890 0.9909 0.9909
dispcorr: -0.022471780 hartree
energy: -1958.471927922451
dipole: -9.66463 9.34922 -0.31541 5.03007 -6.51539 -1.48532 -28.33746 27.22304 -1.11442
magnitude: 1.88351 au
magnitude: 4.78750 debye
