program: Orca
programVersion: 5.0.3
elementType: Cl Cl O O O C C C C C C C C C C C C C C C C C C C C C H H H H H H H H H H H H H H H H H H H H
charge: 0
multiplicity: 1
keywords: wb97x-d3
keywords: def2-TZVPP
keywords: def2/J RIJCOSX
keywords: DEFGRID2
keywords: scfconv7
keywords: smallprint printgap noloewdin
keywords: NOSOSCF
formula: C21H20Cl2O3
InChI: InChI=1/C21H20Cl2O3/c1-21(2)17(12-18(22)23)19(21)20(24)25-13-14-7-6-10-16(11-14)26-15-8-4-3-5-9-15/h3-12,17,19H,13H2,1-2H3
46 atoms
Cl 2.85195 0.328215 -2.201976
Cl 4.506724 0.825793 0.107374
O  -1.804049 -2.10132 0.929183
O  -1.265296 -2.3506 -1.227986
O  -2.063706 2.819073 -0.281379
C  1.440117 -3.401272 -0.005748
C  1.596342 -1.975627 -0.449119
C  0.440517 -2.364199 0.458165
C  2.339346 -3.963369 1.069453
C  1.070497 -4.422416 -1.053693
C  2.651273 -1.102924 0.077982
C  -0.936449 -2.282597 -0.069602
C  3.244059 -0.119409 -0.587457
C  -3.177935 -1.924589 0.612737
C  -3.523922 -0.508306 0.231731
C  -2.570322 0.498858 0.170726
C  -4.856692 -0.21416 -0.044126
C  -2.954607 1.793155 -0.164476
C  -5.225359 1.078627 -0.37861
C  -4.281057 2.092305 -0.439264
C  -0.846723 2.756296 0.347491
C  0.290455 2.944784 -0.423878
C  -0.752556 2.568968 1.721169
C  1.536665 2.952715 0.188483
C  0.499585 2.563779 2.318094
C  1.646893 2.7547 1.557401
H  1.310386 -1.795175 -1.479157
H  0.53538 -2.077715 1.499426
H  3.306996 -4.250191 0.653709
H  2.51822 -3.267116 1.887899
H  1.887282 -4.85748 1.50263
H  0.461719 -5.219674 -0.622877
H  0.526496 -4.000827 -1.895528
H  1.978916 -4.880728 -1.448912
H  2.986816 -1.268262 1.094869
H  -3.491486 -2.617957 -0.170614
H  -3.713994 -2.200708 1.521294
H  -1.530753 0.293133 0.387484
H  -5.605666 -0.995801 0.005408
H  -6.26255 1.305754 -0.589043
H  -4.567481 3.104043 -0.697659
H  0.200169 3.090514 -1.493147
H  -1.644645 2.430006 2.320501
H  2.423436 3.10763 -0.412438
H  0.575738 2.415354 3.387757
H  2.619594 2.752536 2.031432
elementType: Cl O C H
totalener: -1958.44991984 hartree
nucrepener: 2641.34078182 hartree
electener: -4599.79070166 hartree
oneelecener: -7936.68323875 hartree
twoeener: 3336.89253709 hartree
cpcmener: -0.02592834 hartree
kineticenergy: 1952.54904225 hartree
xcener: -143.508834724928 hartree
chargesum: 0.0000000
charge: -0.058246 -0.063459 -0.290978 -0.453288 -0.326072 0.091673 0.040021 -0.075034 -0.273677 -0.269270 -0.209463 0.375283 0.055424 0.086262 0.019804 -0.212878 -0.261608 0.308342 -0.102024 -0.264859 0.277492 -0.226875 -0.192870 -0.121847 -0.141890 -0.174588 0.080795 0.096103 0.102818 0.092169 0.097969 0.099727 0.094451 0.096858 0.126240 0.117492 0.131660 0.136608 0.141208 0.155365 0.142880 0.143831 0.155285 0.145458 0.158442 0.149267
qa: -0.0582 -0.0635 -0.2910 -0.4533 -0.3261 0.0917 0.0400 -0.0750 -0.2737 -0.2693 -0.2095 0.3753 0.0554 0.0863 0.0198 -0.2129 -0.2616 0.3083 -0.1020 -0.2649 0.2775 -0.2269 -0.1929 -0.1218 -0.1419 -0.1746 0.0808 0.0961 0.1028 0.0922 0.0980 0.0997 0.0945 0.0969 0.1262 0.1175 0.1317 0.1366 0.1412 0.1554 0.1429 0.1438 0.1553 0.1455 0.1584 0.1493
va: 1.2652 1.2404 2.1209 2.0512 2.0841 3.7673 3.8498 3.8133 3.9113 3.9028 3.9244 4.1889 4.2001 3.8155 3.6689 3.9043 3.9944 3.7212 3.8897 4.0037 3.7006 4.0139 3.9302 3.8147 3.9055 3.8612 1.0492 1.0329 1.0000 1.0054 1.0013 0.9994 1.0197 0.9999 1.0219 1.0122 0.9903 1.0131 1.0005 0.9889 1.0094 1.0099 0.9961 1.0092 0.9900 1.0021
dispcorr: -0.026022984 hartree
energy: -1958.475942818777
dipole: -16.11519 16.06503 -0.05016 -19.02232 17.68448 -1.33785 10.41218 -8.69143 1.72076
magnitude: 2.18022 au
magnitude: 5.54167 debye
