program: Orca
programVersion: 5.0.3
elementType: Cl Cl O O O C C C C C C C C C C C C C C C C C C C C C H H H H H H H H H H H H H H H H H H H H
charge: 0
multiplicity: 1
keywords: wb97x-d3
keywords: def2-TZVPP
keywords: def2/J RIJCOSX
keywords: DEFGRID2
keywords: scfconv7
keywords: smallprint printgap noloewdin
keywords: NOSOSCF
formula: C21H20Cl2O3
InChI: InChI=1/C21H20Cl2O3/c1-21(2)17(12-18(22)23)19(21)20(24)25-13-14-7-6-10-16(11-14)26-15-8-4-3-5-9-15/h3-12,17,19H,13H2,1-2H3
46 atoms
Cl 3.046187 -1.039188 2.377582
Cl 2.973654 -3.780678 3.273283
O  -1.626604 -1.795705 -1.553694
O  -0.05509 -0.207749 -1.581153
O  -2.753479 3.615783 0.333262
C  1.919793 -2.627647 -1.70634
C  1.77928 -2.178235 -0.281491
C  0.53776 -2.480143 -1.1074
C  2.357918 -4.041514 -2.006728
C  2.447575 -1.629452 -2.707517
C  2.099305 -3.054391 0.850151
C  -0.372272 -1.363885 -1.436963
C  2.633184 -2.667531 2.002168
C  -2.649263 -0.816612 -1.775862
C  -2.841264 0.066073 -0.57507
C  -2.716014 1.441922 -0.700838
C  -3.126182 -0.490439 0.669417
C  -2.850788 2.254535 0.417441
C  -3.274342 0.331389 1.775303
C  -3.127398 1.707047 1.660362
C  -1.753777 4.192743 -0.39962
C  -2.039401 5.421005 -0.98148
C  -0.489822 3.627465 -0.52882
C  -1.05471 6.085272 -1.697474
C  0.481046 4.299503 -1.257982
C  0.207456 5.526605 -1.846052
H  1.963258 -1.121534 -0.124282
H  0.037144 -3.415568 -0.884331
H  3.438898 -4.141614 -1.891943
H  1.882545 -4.78596 -1.368656
H  2.110759 -4.297965 -3.038521
H  3.530647 -1.739971 -2.790675
H  2.022243 -1.810244 -3.696744
H  2.245437 -0.596179 -2.436526
H  1.879142 -4.110654 0.751456
H  -2.430768 -0.227665 -2.668816
H  -3.544849 -1.404507 -1.975841
H  -2.496216 1.872762 -1.670482
H  -3.23102 -1.563013 0.778386
H  -3.495369 -0.100067 2.742982
H  -3.227741 2.348804 2.526579
H  -3.026235 5.852951 -0.870745
H  -0.252252 2.67445 -0.073047
H  -1.282769 7.042152 -2.149266
H  1.46279 3.855158 -1.360053
H  0.97067 6.043174 -2.412844
elementType: Cl O C H
totalener: -1958.44942717 hartree
nucrepener: 2510.38581332 hartree
electener: -4468.83524049 hartree
oneelecener: -7675.00062584 hartree
twoeener: 3206.16538535 hartree
cpcmener: -0.02513891 hartree
kineticenergy: 1952.56794682 hartree
xcener: -143.507246082033 hartree
chargesum: 0.0000000
charge: -0.055971 -0.061732 -0.287227 -0.466168 -0.331235 0.094562 0.025023 -0.077451 -0.270340 -0.271912 -0.202792 0.403481 0.042733 0.098163 0.027709 -0.204403 -0.250139 0.275825 -0.111081 -0.246295 0.295215 -0.255448 -0.190309 -0.119061 -0.146176 -0.191991 0.081435 0.093541 0.101436 0.091601 0.097451 0.095896 0.098946 0.096031 0.126643 0.114929 0.125787 0.142479 0.140716 0.157588 0.146338 0.144125 0.149913 0.157122 0.158346 0.156698
qa: -0.0560 -0.0617 -0.2872 -0.4662 -0.3312 0.0946 0.0250 -0.0775 -0.2703 -0.2719 -0.2028 0.4035 0.0427 0.0982 0.0277 -0.2044 -0.2501 0.2758 -0.1111 -0.2463 0.2952 -0.2554 -0.1903 -0.1191 -0.1462 -0.1920 0.0814 0.0935 0.1014 0.0916 0.0975 0.0959 0.0989 0.0960 0.1266 0.1149 0.1258 0.1425 0.1407 0.1576 0.1463 0.1441 0.1499 0.1571 0.1583 0.1567
va: 1.2697 1.2431 2.1246 2.0382 2.0771 3.7248 3.8716 3.8317 3.9109 3.9018 3.9035 4.1652 4.2108 3.7978 3.6065 3.9251 3.9669 3.7207 3.8841 4.0235 3.6946 4.0053 3.8888 3.8849 3.8981 3.9099 1.0443 1.0338 1.0004 1.0055 1.0014 0.9997 0.9994 1.0210 1.0204 1.0087 0.9913 1.0084 1.0095 0.9887 1.0059 1.0091 1.0069 0.9890 0.9909 0.9909
dispcorr: -0.022383405 hartree
energy: -1958.471810572523
dipole: -9.45436 9.13843 -0.31593 6.07439 -7.50890 -1.43451 -28.55204 27.36891 -1.18313
magnitude: 1.88612 au
magnitude: 4.79413 debye
