program: Orca
programVersion: 5.0.3
elementType: Cl Cl O O O C C C C C C C C C C C C C C C C C C C C C H H H H H H H H H H H H H H H H H H H H
charge: 0
multiplicity: 1
keywords: wb97x-d3
keywords: def2-TZVPP
keywords: def2/J RIJCOSX
keywords: DEFGRID2
keywords: scfconv7
keywords: smallprint printgap noloewdin
keywords: NOSOSCF
formula: C21H20Cl2O3
InChI: InChI=1/C21H20Cl2O3/c1-21(2)17(12-18(22)23)19(21)20(24)25-13-14-7-6-10-16(11-14)26-15-8-4-3-5-9-15/h3-12,17,19H,13H2,1-2H3
46 atoms
Cl 3.042718 -1.349527 2.4854
Cl 2.790701 -4.129592 3.214187
O  -1.587101 -1.742443 -1.585174
O  0.011323 -0.180899 -1.584027
O  -2.66634 3.648863 0.42097
C  1.980751 -2.584902 -1.6951
C  1.756542 -2.244702 -0.250306
C  0.566278 -2.47408 -1.169637
C  2.431213 -3.974725 -2.077605
C  2.577296 -1.518974 -2.581835
C  2.001487 -3.207656 0.828497
C  -0.325059 -1.334456 -1.465792
C  2.540984 -2.92506 2.007663
C  -2.59561 -0.743983 -1.783944
C  -2.772874 0.116718 -0.564965
C  -2.639588 1.494499 -0.666432
C  -3.055196 -0.462115 0.669439
C  -2.762818 2.287229 0.4674
C  -3.19173 0.340351 1.79115
C  -3.036394 1.71624 1.701166
C  -1.745162 4.267063 -0.37688
C  -2.103678 5.509022 -0.883891
C  -0.48664 3.735683 -0.635055
C  -1.198953 6.222213 -1.655786
C  0.402745 4.45625 -1.419997
C  0.055674 5.698138 -1.933579
H  1.936306 -1.204634 -0.003265
H  0.054846 -3.421529 -1.043217
H  1.929917 -4.762237 -1.515702
H  2.229244 -4.154517 -3.135175
H  3.506332 -4.085258 -1.923733
H  3.658808 -1.66252 -2.635555
H  2.186122 -1.592355 -3.598572
H  2.400889 -0.50761 -2.223219
H  1.719719 -4.240106 0.659726
H  -2.370636 -0.140159 -2.66562
H  -3.500048 -1.315282 -1.993467
H  -2.426168 1.938439 -1.631282
H  -3.167419 -1.535562 0.759697
H  -3.411896 -0.106866 2.75183
H  -3.129995 2.341421 2.579997
H  -3.084794 5.914131 -0.671066
H  -0.191322 2.772952 -0.237854
H  -1.48351 7.190246 -2.047332
H  1.380239 4.038905 -1.623936
H  0.756739 6.252448 -2.543298
elementType: Cl O C H
totalener: -1958.44898646 hartree
nucrepener: 2501.62229371 hartree
electener: -4460.07128017 hartree
oneelecener: -7657.42622124 hartree
twoeener: 3197.35494108 hartree
cpcmener: -0.02496516 hartree
kineticenergy: 1952.57396577 hartree
xcener: -143.508447197315 hartree
chargesum: -0.0000000
charge: -0.055766 -0.060967 -0.287279 -0.466215 -0.328858 0.098394 0.022768 -0.079171 -0.267419 -0.273293 -0.202417 0.403692 0.040962 0.096876 0.029433 -0.218726 -0.255779 0.298209 -0.105978 -0.257787 0.310055 -0.263022 -0.206428 -0.114920 -0.141045 -0.194285 0.083538 0.091980 0.089845 0.098406 0.100478 0.095039 0.099491 0.095959 0.128062 0.114961 0.125253 0.142850 0.140453 0.157451 0.145786 0.144305 0.152074 0.157025 0.159025 0.156984
qa: -0.0558 -0.0610 -0.2873 -0.4662 -0.3289 0.0984 0.0228 -0.0792 -0.2674 -0.2733 -0.2024 0.4037 0.0410 0.0969 0.0294 -0.2187 -0.2558 0.2982 -0.1060 -0.2578 0.3101 -0.2630 -0.2064 -0.1149 -0.1410 -0.1943 0.0835 0.0920 0.0898 0.0984 0.1005 0.0950 0.0995 0.0960 0.1281 0.1150 0.1253 0.1428 0.1405 0.1575 0.1458 0.1443 0.1521 0.1570 0.1590 0.1570
va: 1.2699 1.2439 2.1241 2.0380 2.0831 3.7126 3.8771 3.8432 3.9106 3.9008 3.8993 4.1589 4.2102 3.7997 3.6114 3.9267 3.9708 3.7068 3.8821 4.0244 3.6831 4.0120 3.9030 3.8808 3.8921 3.9143 1.0432 1.0351 1.0057 1.0011 1.0008 0.9999 0.9994 1.0210 1.0192 1.0087 0.9914 1.0079 1.0098 0.9886 1.0068 1.0095 1.0063 0.9891 0.9905 0.9909
dispcorr: -0.022259542 hartree
energy: -1958.471245998217
dipole: -8.77875 8.44471 -0.33404 8.67510 -9.97209 -1.29699 -28.80743 27.56393 -1.24350
magnitude: 1.82759 au
magnitude: 4.64535 debye
