program: Orca
programVersion: 5.0.3
elementType: Cl Cl O O O C C C C C C C C C C C C C C C C C C C C C H H H H H H H H H H H H H H H H H H H H
charge: 0
multiplicity: 1
keywords: wb97x-d3
keywords: def2-TZVPP
keywords: def2/J RIJCOSX
keywords: DEFGRID2
keywords: scfconv7
keywords: smallprint printgap noloewdin
keywords: NOSOSCF
formula: C21H20Cl2O3
InChI: InChI=1/C21H20Cl2O3/c1-21(2)17(12-18(22)23)19(21)20(24)25-13-14-7-6-10-16(11-14)26-15-8-4-3-5-9-15/h3-12,17,19H,13H2,1-2H3
46 atoms
Cl 2.93616 -5.058651 0.696814
Cl 4.574647 -5.101026 -1.677222
O  -1.396803 -0.996486 -1.930992
O  -1.158938 -2.068924 0.014349
O  -1.138179 3.212194 0.644622
C  1.769401 -0.89522 -0.469676
C  1.743041 -2.399728 -0.524801
C  0.757641 -1.603881 -1.348567
C  2.855362 -0.132129 -1.187926
C  1.347408 -0.237351 0.821811
C  2.790406 -3.159955 -1.217436
C  -0.676173 -1.609262 -0.990543
C  3.351412 -4.280563 -0.781373
C  -2.767593 -0.730373 -1.634358
C  -2.913592 0.295681 -0.543886
C  -2.011136 1.348512 -0.450508
C  -3.960612 0.210852 0.365725
C  -2.133943 2.282664 0.567435
C  -4.090818 1.168328 1.362007
C  -3.175901 2.203718 1.483667
C  -1.366719 4.487715 1.077113
C  -2.502915 5.208261 0.729183
C  -0.359125 5.075151 1.83061
C  -2.62269 6.525109 1.151279
C  -0.48753 6.3957 2.233895
C  -1.62044 7.125498 1.901429
H  1.323567 -2.872929 0.355794
H  0.95435 -1.530868 -2.412774
H  3.097569 -0.546658 -2.165802
H  2.543943 0.902184 -1.344833
H  3.771459 -0.115012 -0.5944
H  0.604015 -0.806574 1.376013
H  2.217205 -0.12098 1.471189
H  0.941104 0.759501 0.638223
H  3.142217 -2.784334 -2.170947
H  -3.183202 -0.359034 -2.571521
H  -3.299308 -1.6495 -1.379751
H  -1.191172 1.445822 -1.152359
H  -4.666394 -0.608535 0.306942
H  -4.902579 1.095368 2.074133
H  -3.273018 2.921611 2.287977
H  -3.285369 4.759688 0.129903
H  0.522258 4.501455 2.089188
H  -3.507056 7.087179 0.880071
H  0.302997 6.852408 2.815404
H  -1.720024 8.154447 2.220867
elementType: Cl O C H
totalener: -1958.44973135 hartree
nucrepener: 2459.16417471 hartree
electener: -4417.61390606 hartree
oneelecener: -7572.19284743 hartree
twoeener: 3154.57894138 hartree
cpcmener: -0.02620832 hartree
kineticenergy: 1952.56224219 hartree
xcener: -143.507748688772 hartree
chargesum: 0.0000000
charge: -0.055980 -0.062489 -0.286887 -0.445571 -0.328132 0.094356 0.027909 -0.064594 -0.267237 -0.266036 -0.202536 0.361501 0.038234 0.098309 0.073709 -0.340265 -0.231250 0.337576 -0.114895 -0.233413 0.293183 -0.204331 -0.253691 -0.146926 -0.122533 -0.184420 0.076192 0.097974 0.090868 0.098310 0.101639 0.096971 0.105492 0.087453 0.127729 0.120952 0.116627 0.133471 0.140526 0.158312 0.157034 0.156462 0.146389 0.158733 0.157556 0.157718
qa: -0.0560 -0.0625 -0.2869 -0.4456 -0.3281 0.0944 0.0279 -0.0646 -0.2672 -0.2660 -0.2025 0.3615 0.0382 0.0983 0.0737 -0.3403 -0.2313 0.3376 -0.1149 -0.2334 0.2932 -0.2043 -0.2537 -0.1469 -0.1225 -0.1844 0.0762 0.0980 0.0909 0.0983 0.1016 0.0970 0.1055 0.0875 0.1277 0.1210 0.1166 0.1335 0.1405 0.1583 0.1570 0.1565 0.1464 0.1587 0.1576 0.1577
va: 1.2699 1.2420 2.1136 2.0603 2.0569 3.7315 3.8896 3.8038 3.9027 3.8955 3.8939 4.2436 4.2088 3.7942 3.5859 4.0310 3.9929 3.6559 3.8925 3.9608 3.6951 3.9192 3.9999 3.8981 3.8876 3.9038 1.0510 1.0325 1.0052 1.0020 1.0010 1.0173 1.0018 1.0073 1.0192 0.9929 1.0086 1.0283 1.0037 0.9899 0.9964 0.9982 1.0070 0.9904 0.9897 0.9905
dispcorr: -0.023040603 hartree
energy: -1958.472771951957
dipole: -19.33155 18.67676 -0.65479 39.16862 -37.37368 1.79494 3.96100 -4.71822 -0.75722
magnitude: 2.05523 au
magnitude: 5.22397 debye
