program: Orca
programVersion: 5.0.3
elementType: Cl Cl O O O C C C C C C C C C C C C C C C C C C C C C H H H H H H H H H H H H H H H H H H H H
charge: 0
multiplicity: 1
keywords: wb97x-d3
keywords: def2-TZVPP
keywords: def2/J RIJCOSX
keywords: DEFGRID2
keywords: scfconv7
keywords: smallprint printgap noloewdin
keywords: NOSOSCF
formula: C21H20Cl2O3
InChI: InChI=1/C21H20Cl2O3/c1-21(2)17(12-18(22)23)19(21)20(24)25-13-14-7-6-10-16(11-14)26-15-8-4-3-5-9-15/h3-12,17,19H,13H2,1-2H3
46 atoms
Cl 2.622743 -5.123599 0.878424
Cl 4.3744 -5.370112 -1.400836
O  -1.300992 -0.889149 -2.098792
O  -1.237603 -1.971236 -0.144372
O  -1.027183 3.269325 0.5779
C  1.779869 -0.952651 -0.492125
C  1.666342 -2.454857 -0.501638
C  0.775625 -1.631369 -1.401203
C  2.945996 -0.277752 -1.171932
C  1.327447 -0.229745 0.753544
C  2.698606 -3.301934 -1.111171
C  -0.673796 -1.545381 -1.121647
C  3.162319 -4.437763 -0.605296
C  -2.672418 -0.551462 -1.887074
C  -2.838763 0.449407 -0.776432
C  -1.909784 1.469973 -0.612323
C  -3.92653 0.370005 0.084474
C  -2.047321 2.375549 0.429666
C  -4.070728 1.300384 1.104084
C  -3.130606 2.301782 1.29749
C  -1.230688 4.522577 1.084304
C  -0.248572 5.01891 1.930754
C  -2.318627 5.308472 0.723779
C  -0.353071 6.314677 2.41426
C  -2.416151 6.598549 1.226069
C  -1.438201 7.10852 2.069558
H  1.173169 -2.870825 0.369553
H  1.030402 -1.606019 -2.4554
H  3.825944 -0.286104 -0.525781
H  3.220787 -0.74357 -2.117654
H  2.702329 0.764767 -1.384722
H  2.164148 -0.143884 1.449624
H  0.992135 0.782724 0.518761
H  0.520694 -0.736431 1.279877
H  3.120582 -2.985369 -2.057602
H  -2.999319 -0.131002 -2.838577
H  -3.269783 -1.446088 -1.699096
H  -1.057338 1.561138 -1.275424
H  -4.652686 -0.425334 -0.029872
H  -4.914426 1.231401 1.778531
H  -3.241144 2.996521 2.120166
H  0.595404 4.395347 2.198483
H  -3.081079 4.929505 0.0546
H  0.418197 6.701153 3.068128
H  -3.263106 7.211465 0.945619
H  -1.519228 8.117635 2.451556
elementType: Cl O C H
totalener: -1958.44971482 hartree
nucrepener: 2460.34617009 hartree
electener: -4418.79588491 hartree
oneelecener: -7574.61469536 hartree
twoeener: 3155.81881045 hartree
cpcmener: -0.02631035 hartree
kineticenergy: 1952.55806468 hartree
xcener: -143.506931210148 hartree
chargesum: -0.0000000
charge: -0.056391 -0.062374 -0.285613 -0.444620 -0.327947 0.093155 0.025707 -0.065166 -0.266862 -0.266443 -0.202602 0.361937 0.038543 0.098462 0.072466 -0.344722 -0.229860 0.340195 -0.117254 -0.232421 0.289681 -0.250598 -0.202417 -0.124016 -0.146942 -0.182245 0.076914 0.098482 0.101503 0.090600 0.098393 0.105785 0.087872 0.095983 0.128439 0.121575 0.116102 0.134328 0.140434 0.158407 0.156465 0.146387 0.156428 0.157924 0.158603 0.157721
qa: -0.0564 -0.0624 -0.2856 -0.4446 -0.3279 0.0932 0.0257 -0.0652 -0.2669 -0.2664 -0.2026 0.3619 0.0385 0.0985 0.0725 -0.3447 -0.2299 0.3402 -0.1173 -0.2324 0.2897 -0.2506 -0.2024 -0.1240 -0.1469 -0.1822 0.0769 0.0985 0.1015 0.0906 0.0984 0.1058 0.0879 0.0960 0.1284 0.1216 0.1161 0.1343 0.1404 0.1584 0.1565 0.1464 0.1564 0.1579 0.1586 0.1577
va: 1.2694 1.2423 2.1145 2.0621 2.0582 3.7356 3.8884 3.8015 3.9019 3.8970 3.8965 4.2472 4.2093 3.7938 3.5858 4.0282 3.9909 3.6594 3.8974 3.9572 3.6956 4.0000 3.9214 3.8869 3.8972 3.9018 1.0510 1.0319 1.0011 1.0053 1.0019 1.0020 1.0071 1.0168 1.0187 0.9926 1.0080 1.0276 1.0038 0.9899 0.9967 1.0068 0.9977 0.9896 0.9903 0.9905
dispcorr: -0.023096431 hartree
energy: -1958.472811248867
dipole: -17.31496 16.81013 -0.50483 39.90767 -38.09730 1.81037 2.49592 -3.29389 -0.79797
magnitude: 2.04183 au
magnitude: 5.18992 debye
