program: Orca
programVersion: 5.0.3
elementType: Cl Cl O O O C C C C C C C C C C C C C C C C C C C C C H H H H H H H H H H H H H H H H H H H H
charge: 0
multiplicity: 1
keywords: wb97x-d3
keywords: def2-TZVPP
keywords: def2/J RIJCOSX
keywords: DEFGRID2
keywords: scfconv7
keywords: smallprint printgap noloewdin
keywords: NOSOSCF
formula: C21H20Cl2O3
InChI: InChI=1/C21H20Cl2O3/c1-21(2)17(12-18(22)23)19(21)20(24)25-13-14-7-6-10-16(11-14)26-15-8-4-3-5-9-15/h3-12,17,19H,13H2,1-2H3
46 atoms
Cl -0.014944 -1.359332 2.172968
Cl 1.379102 -3.209125 3.902542
O  -1.268985 -1.838319 -1.653919
O  0.416505 -0.377435 -1.796833
O  -1.849936 3.625748 0.056741
C  2.228057 -2.895556 -1.270933
C  1.951031 -2.181662 0.004632
C  0.7926 -2.564554 -0.898515
C  2.574879 -4.363858 -1.223482
C  2.931893 -2.152358 -2.378838
C  2.06337 -2.819382 1.334069
C  0.00407 -1.47407 -1.5020
C  1.259667 -2.503252 2.339692
C  -2.217078 -0.8207 -2.003754
C  -2.424645 0.120091 -0.850738
C  -2.0743 1.456999 -0.970603
C  -2.916506 -0.359952 0.360545
C  -2.182776 2.301993 0.126653
C  -3.045647 0.497669 1.441485
C  -2.66881 1.829578 1.33631
C  -0.757061 4.022121 -0.664986
C  0.421388 3.284902 -0.70495
C  -0.852511 5.238138 -1.326957
C  1.499359 3.772283 -1.429789
C  0.238675 5.718337 -2.036519
C  1.415722 4.985932 -2.098937
H  2.180583 -1.119012 -0.001424
H  0.203241 -3.414151 -0.573023
H  2.349371 -4.839508 -2.17921
H  3.640716 -4.500467 -1.030609
H  2.024374 -4.903117 -0.452032
H  2.625977 -2.530307 -3.35595
H  2.749438 -1.080579 -2.360276
H  4.009891 -2.301522 -2.291972
H  2.83987 -3.554001 1.510935
H  -1.905808 -0.28948 -2.904875
H  -3.129523 -1.368783 -2.23615
H  -1.696214 1.826523 -1.9160
H  -3.193885 -1.401971 0.462572
H  -3.428803 0.12651 2.383182
H  -2.749672 2.496234 2.185681
H  0.507218 2.340303 -0.182736
H  -1.774662 5.803809 -1.282965
H  2.414083 3.19484 -1.465105
H  0.160695 6.667318 -2.551044
H  2.261588 5.35837 -2.661546
elementType: Cl O C H
totalener: -1958.44678112 hartree
nucrepener: 2616.10807300 hartree
electener: -4574.55485412 hartree
oneelecener: -7886.81120690 hartree
twoeener: 3312.25635277 hartree
cpcmener: -0.02392353 hartree
kineticenergy: 1952.58849343 hartree
xcener: -143.510834912251 hartree
chargesum: 0.0000000
charge: -0.053718 -0.056954 -0.281734 -0.467663 -0.330917 0.139578 -0.055082 -0.097871 -0.281633 -0.274029 -0.215674 0.379072 0.080578 0.093170 0.056839 -0.199349 -0.296306 0.283256 -0.115017 -0.237198 0.295665 -0.190107 -0.252778 -0.143249 -0.119987 -0.189192 0.116911 0.105635 0.098981 0.101624 0.092331 0.099101 0.094679 0.094795 0.139925 0.113134 0.126570 0.140083 0.140437 0.158271 0.146728 0.144081 0.144480 0.158097 0.156879 0.157558
qa: -0.0537 -0.0570 -0.2817 -0.4677 -0.3309 0.1396 -0.0551 -0.0979 -0.2816 -0.2740 -0.2157 0.3791 0.0806 0.0932 0.0568 -0.1993 -0.2963 0.2833 -0.1150 -0.2372 0.2957 -0.1901 -0.2528 -0.1432 -0.1200 -0.1892 0.1169 0.1056 0.0990 0.1016 0.0923 0.0991 0.0947 0.0948 0.1399 0.1131 0.1266 0.1401 0.1404 0.1583 0.1467 0.1441 0.1445 0.1581 0.1569 0.1576
va: 1.2949 1.2504 2.1169 2.0293 2.0800 3.7231 3.8864 3.8086 3.9116 3.8862 3.9046 4.1704 4.1847 3.8052 3.5419 3.9165 3.9337 3.7193 3.8193 4.0106 3.6849 3.8929 4.0074 3.8937 3.8832 3.9086 1.0202 1.0269 1.0029 0.9993 0.9994 0.9992 1.0200 1.0011 1.0078 1.0097 0.9924 1.0118 1.0125 0.9888 1.0048 1.0121 1.0089 0.9908 0.9892 0.9906
dispcorr: -0.025499291 hartree
energy: -1958.472280412456
dipole: 7.83389 -7.36117 0.47272 3.27864 -4.65719 -1.37854 -27.43913 26.70884 -0.73029
magnitude: 1.63008 au
magnitude: 4.14334 debye
