program: Orca
programVersion: 5.0.3
elementType: Cl Cl O O O C C C C C C C C C C C C C C C C C C C C C H H H H H H H H H H H H H H H H H H H H
charge: 0
multiplicity: 1
keywords: wb97x-d3
keywords: def2-TZVPP
keywords: def2/J RIJCOSX
keywords: DEFGRID2
keywords: scfconv7
keywords: smallprint printgap noloewdin
keywords: NOSOSCF
formula: C21H20Cl2O3
InChI: InChI=1/C21H20Cl2O3/c1-21(2)17(12-18(22)23)19(21)20(24)25-13-14-7-6-10-16(11-14)26-15-8-4-3-5-9-15/h3-12,17,19H,13H2,1-2H3
46 atoms
Cl 2.481714 -0.14726 -2.547717
Cl 4.520303 0.609211 -0.651851
O  -1.52585 -2.015248 0.03542
O  -1.43905 -2.283754 2.256073
O  -2.444071 2.977042 0.715649
C  1.280968 -3.353609 0.17798
C  1.334956 -1.898057 -0.200076
C  0.580003 -2.324702 1.040951
C  2.494038 -4.01219 0.788804
C  0.495578 -4.284447 -0.712487
C  2.552871 -1.096212 -0.024331
C  -0.88787 -2.20962 1.184088
C  3.107205 -0.328595 -0.953596
C  -2.947153 -1.877838 0.021057
C  -3.350936 -0.449929 -0.221595
C  -2.657965 0.603318 0.364928
C  -4.463456 -0.183776 -1.013225
C  -3.070986 1.909699 0.139723
C  -4.880922 1.124952 -1.208565
C  -4.184659 2.181061 -0.643307
C  -1.088399 2.959904 0.905862
C  -0.210284 2.561311 -0.095078
C  -0.611293 3.41929 2.124156
C  1.155141 2.619887 0.140476
C  0.758287 3.481784 2.341634
C  1.646908 3.07657 1.35614
H  0.723934 -1.633569 -1.055013
H  1.080155 -2.130163 1.983563
H  3.206245 -4.298135 0.01231
H  3.014349 -3.372305 1.50061
H  2.202305 -4.920228 1.31972
H  1.165429 -4.740535 -1.444318
H  0.048429 -5.092734 -0.130159
H  -0.297548 -3.788168 -1.267788
H  3.042811 -1.12269 0.942041
H  -3.306606 -2.512181 -0.78908
H  -3.381043 -2.249826 0.950145
H  -1.802525 0.419571 1.002818
H  -5.002805 -0.997855 -1.481666
H  -5.746584 1.328587 -1.825374
H  -4.498638 3.204414 -0.806887
H  -0.578743 2.214592 -1.052219
H  -1.306521 3.730213 2.893571
H  1.838206 2.321949 -0.643561
H  1.127843 3.843274 3.292404
H  2.714019 3.120761 1.52975
elementType: Cl O C H
totalener: -1958.44774802 hartree
nucrepener: 2622.06839542 hartree
electener: -4580.51614344 hartree
oneelecener: -7897.47533587 hartree
twoeener: 3316.95919244 hartree
cpcmener: -0.02581779 hartree
kineticenergy: 1952.56154783 hartree
xcener: -143.508401412232 hartree
chargesum: -0.0000000
charge: -0.059129 -0.061472 -0.274321 -0.459473 -0.329181 0.087607 0.061464 -0.109038 -0.262853 -0.267550 -0.211308 0.402493 0.030786 0.066037 0.039692 -0.202061 -0.244165 0.266190 -0.103703 -0.255445 0.276948 -0.181975 -0.243761 -0.143056 -0.120381 -0.177140 0.085113 0.096727 0.100201 0.089030 0.099228 0.096289 0.102203 0.093915 0.131858 0.113849 0.115156 0.155987 0.140220 0.156637 0.145589 0.150904 0.145449 0.148259 0.156716 0.151464
qa: -0.0591 -0.0615 -0.2743 -0.4595 -0.3292 0.0876 0.0615 -0.1090 -0.2629 -0.2676 -0.2113 0.4025 0.0308 0.0660 0.0397 -0.2021 -0.2442 0.2662 -0.1037 -0.2554 0.2769 -0.1820 -0.2438 -0.1431 -0.1204 -0.1771 0.0851 0.0967 0.1002 0.0890 0.0992 0.0963 0.1022 0.0939 0.1319 0.1138 0.1152 0.1560 0.1402 0.1566 0.1456 0.1509 0.1454 0.1483 0.1567 0.1515
va: 1.2639 1.2419 2.1147 2.0441 2.0762 3.7526 3.7889 3.8696 3.9091 3.9062 3.8603 4.1994 4.1976 3.8322 3.6937 3.9123 3.9833 3.7622 3.8927 4.0167 3.7056 3.9179 4.0100 3.8503 3.8989 3.9088 1.0434 1.0318 1.0010 1.0054 1.0014 1.0005 0.9996 1.0134 1.0170 0.9963 1.0168 1.0009 1.0035 0.9889 1.0071 1.0017 1.0079 1.0003 0.9892 0.9968
dispcorr: -0.025644018 hartree
energy: -1958.473392036906
dipole: -14.89529 15.03190 0.13661 -16.34410 15.13302 -1.21108 8.72309 -9.38272 -0.65963
magnitude: 1.38582 au
magnitude: 3.52247 debye
