program: Orca
programVersion: 5.0.3
elementType: Cl Cl O O O C C C C C C C C C C C C C C C C C C C C C H H H H H H H H H H H H H H H H H H H H
charge: 0
multiplicity: 1
keywords: wb97x-d3
keywords: def2-TZVPP
keywords: def2/J RIJCOSX
keywords: DEFGRID2
keywords: scfconv7
keywords: smallprint printgap noloewdin
keywords: NOSOSCF
formula: C21H20Cl2O3
InChI: InChI=1/C21H20Cl2O3/c1-21(2)17(12-18(22)23)19(21)20(24)25-13-14-7-6-10-16(11-14)26-15-8-4-3-5-9-15/h3-12,17,19H,13H2,1-2H3
46 atoms
Cl 0.768913 -0.090156 -1.031191
Cl 3.578168 0.328939 -0.49286
O  -1.720852 -2.507137 0.923135
O  -1.597426 -3.247014 -1.186953
O  -1.566376 2.685239 1.53323
C  1.222365 -4.383923 -0.288864
C  1.34917 -3.044437 -0.920618
C  0.34851 -3.245506 0.208145
C  2.284304 -4.836484 0.683167
C  0.635703 -5.51111 -1.100477
C  2.478011 -2.117833 -0.69462
C  -1.072052 -3.033544 -0.117392
C  2.307628 -0.803095 -0.735467
C  -2.98239 -1.858797 0.684305
C  -2.725727 -0.471632 0.169429
C  -2.264157 0.499609 1.051886
C  -2.859663 -0.165046 -1.179842
C  -1.953173 1.769598 0.590656
C  -2.542171 1.108325 -1.631913
C  -2.089886 2.084219 -0.756587
C  -0.717995 3.711037 1.189739
C  0.479762 3.474743 0.526842
C  -1.07055 4.992185 1.585207
C  1.319097 4.542515 0.245902
C  -0.213758 6.049744 1.31106
C  0.977914 5.831764 0.634227
H  0.888207 -2.957152 -1.900958
H  0.646194 -2.841943 1.168726
H  2.661283 -4.022166 1.302342
H  1.887811 -5.602103 1.351548
H  3.13045 -5.269834 0.14698
H  0.115742 -6.221839 -0.456283
H  -0.061566 -5.171482 -1.862513
H  1.43727 -6.051166 -1.606897
H  3.469914 -2.507852 -0.49863
H  -3.605084 -2.438164 0.003013
H  -3.47273 -1.834793 1.655746
H  -2.151089 0.271286 2.105528
H  -3.212139 -0.914392 -1.876338
H  -2.652294 1.350739 -2.680667
H  -1.859492 3.074878 -1.126499
H  0.763472 2.471313 0.236589
H  -2.004216 5.159786 2.106866
H  2.250927 4.359636 -0.273198
H  -0.48728 7.049117 1.622703
H  1.639229 6.659135 0.414713
elementType: Cl O C H
totalener: -1958.43188004 hartree
nucrepener: 2643.17260225 hartree
electener: -4601.60448230 hartree
oneelecener: -7940.92641812 hartree
twoeener: 3339.32193583 hartree
cpcmener: -0.02797238 hartree
kineticenergy: 1952.57117484 hartree
xcener: -143.509094380533 hartree
chargesum: -0.0000000
charge: -0.054694 -0.057592 -0.287613 -0.490881 -0.338463 0.143234 -0.044103 -0.094935 -0.279001 -0.269246 -0.213480 0.382857 0.087840 0.094403 -0.006803 -0.268597 -0.171918 0.285622 -0.162161 -0.189874 0.244989 -0.144699 -0.219880 -0.171381 -0.142599 -0.165206 0.111490 0.105859 0.092789 0.098842 0.102609 0.100840 0.090016 0.095779 0.144578 0.113790 0.123752 0.133290 0.143706 0.160411 0.154630 0.134565 0.148176 0.157068 0.160515 0.161476
qa: -0.0547 -0.0576 -0.2876 -0.4909 -0.3385 0.1432 -0.0441 -0.0949 -0.2790 -0.2692 -0.2135 0.3829 0.0878 0.0944 -0.0068 -0.2686 -0.1719 0.2856 -0.1622 -0.1899 0.2450 -0.1447 -0.2199 -0.1714 -0.1426 -0.1652 0.1115 0.1059 0.0928 0.0988 0.1026 0.1008 0.0900 0.0958 0.1446 0.1138 0.1238 0.1333 0.1437 0.1604 0.1546 0.1346 0.1482 0.1571 0.1605 0.1615
va: 1.3129 1.2516 2.1068 2.0028 2.0592 3.7347 3.8766 3.8002 3.9141 3.8796 3.9115 4.1750 4.1631 3.7955 3.6559 4.0606 3.8956 3.6851 3.9131 3.8743 3.7095 3.8718 3.9834 3.9219 3.8849 3.8828 1.0292 1.0283 0.9995 1.0028 0.9990 0.9992 1.0196 1.0010 1.0070 1.0127 0.9972 1.0203 1.0130 0.9915 0.9987 1.0313 1.0062 0.9927 0.9886 0.9889
dispcorr: -0.026439382 hartree
energy: -1958.458319425850
dipole: -6.08048 6.88036 0.79988 -14.80582 14.40058 -0.40524 2.58399 -2.23900 0.34499
magnitude: 0.96075 au
magnitude: 2.44205 debye
