program: Orca
programVersion: 5.0.3
elementType: Cl Cl O O O C C C C C C C C C C C C C C C C C C C C C H H H H H H H H H H H H H H H H H H H H
charge: 0
multiplicity: 1
keywords: wb97x-d3
keywords: def2-TZVPP
keywords: def2/J RIJCOSX
keywords: DEFGRID2
keywords: scfconv7
keywords: smallprint printgap noloewdin
keywords: NOSOSCF
formula: C21H20Cl2O3
InChI: InChI=1/C21H20Cl2O3/c1-21(2)17(12-18(22)23)19(21)20(24)25-13-14-7-6-10-16(11-14)26-15-8-4-3-5-9-15/h3-12,17,19H,13H2,1-2H3
46 atoms
Cl 4.860536 -2.531859 -2.03108
Cl 5.147595 -5.146514 -0.848896
O  -0.34303 -1.182875 1.50769
O  0.762335 -0.109297 -0.111768
O  -3.113438 3.889153 -0.107073
C  0.447542 -2.983995 -1.421845
C  1.875506 -2.718255 -1.033351
C  0.771831 -2.506599 -0.020467
C  -0.054789 -4.402084 -1.539958
C  -0.191715 -2.048801 -2.418417
C  2.828528 -3.809607 -0.799183
C  0.426822 -1.14187 0.420431
C  4.099585 -3.819028 -1.178714
C  -0.872712 0.05289 1.987521
C  -1.920103 0.620435 1.07049
C  -1.997043 1.997651 0.908333
C  -2.833031 -0.206866 0.422038
C  -3.007144 2.54407 0.126248
C  -3.817969 0.351112 -0.378576
C  -3.919772 1.726446 -0.5239
C  -2.820373 4.806441 0.869685
C  -2.243639 5.99664 0.447905
C  -3.139031 4.608293 2.20798
C  -1.983815 6.996599 1.373585
C  -2.860078 5.612833 3.124308
C  -2.284417 6.808543 2.715756
H  2.293023 -1.809565 -1.451669
H  0.670519 -3.264555 0.748377
H  -1.143545 -4.418107 -1.47195
H  0.222664 -4.82603 -2.506472
H  0.328628 -5.060242 -0.761671
H  0.246961 -1.05366 -2.420035
H  -0.077598 -2.456418 -3.423989
H  -1.260917 -1.948213 -2.22241
H  2.475204 -4.682744 -0.263757
H  -1.313148 -0.196745 2.952664
H  -0.074936 0.775533 2.1678
H  -1.26628 2.63417 1.393415
H  -2.783131 -1.28219 0.535112
H  -4.525742 -0.290285 -0.886985
H  -4.695767 2.162063 -1.140128
H  -2.007825 6.139715 -0.599102
H  -3.601505 3.688065 2.541377
H  -1.539237 7.92508 1.040093
H  -3.10422 5.456913 4.166942
H  -2.075757 7.587565 3.436534
elementType: Cl O C H
totalener: -1958.43598980 hartree
nucrepener: 2416.89790865 hartree
electener: -4375.33389845 hartree
oneelecener: -7487.75807267 hartree
twoeener: 3112.42417422 hartree
cpcmener: -0.03246847 hartree
kineticenergy: 1952.56193811 hartree
xcener: -143.508574245079 hartree
chargesum: -0.0000000
charge: -0.058101 -0.062893 -0.290303 -0.482163 -0.337993 0.092854 0.026689 -0.066530 -0.267447 -0.267498 -0.201700 0.394368 0.037633 0.103696 0.048393 -0.230721 -0.281061 0.305508 -0.101623 -0.267872 0.309633 -0.263437 -0.210610 -0.118867 -0.142248 -0.196027 0.075481 0.099283 0.098596 0.101468 0.093079 0.094282 0.102835 0.095628 0.133050 0.124702 0.118465 0.144948 0.145357 0.161162 0.148924 0.148010 0.158474 0.160927 0.162593 0.161057
qa: -0.0581 -0.0629 -0.2903 -0.4822 -0.3380 0.0929 0.0267 -0.0665 -0.2674 -0.2675 -0.2017 0.3944 0.0376 0.1037 0.0484 -0.2307 -0.2811 0.3055 -0.1016 -0.2679 0.3096 -0.2634 -0.2106 -0.1189 -0.1422 -0.1960 0.0755 0.0993 0.0986 0.1015 0.0931 0.0943 0.1028 0.0956 0.1331 0.1247 0.1185 0.1449 0.1454 0.1612 0.1489 0.1480 0.1585 0.1609 0.1626 0.1611
va: 1.2677 1.2421 2.1189 2.0199 2.0678 3.7317 3.8907 3.8120 3.9058 3.8987 3.8939 4.1933 4.2064 3.7850 3.5973 3.9692 3.9467 3.6825 3.8760 4.0238 3.6637 4.0084 3.9123 3.8747 3.8827 3.9058 1.0501 1.0332 1.0013 1.0009 1.0051 1.0179 1.0014 1.0019 1.0172 0.9917 1.0105 1.0070 1.0118 0.9875 1.0062 1.0082 0.9966 0.9881 0.9890 0.9897
dispcorr: -0.022178713 hartree
energy: -1958.458168517277
dipole: -35.51998 34.02744 -1.49255 15.25609 -16.17293 -0.91683 5.73911 -4.57830 1.16081
magnitude: 2.10137 au
magnitude: 5.34126 debye
