program: Orca
programVersion: 5.0.3
elementType: Cl Cl O O O C C C C C C C C C C C C C C C C C C C C C H H H H H H H H H H H H H H H H H H H H
charge: 0
multiplicity: 1
keywords: wb97x-d3
keywords: def2-TZVPP
keywords: def2/J RIJCOSX
keywords: DEFGRID2
keywords: scfconv7
keywords: smallprint printgap noloewdin
keywords: NOSOSCF
formula: C21H20Cl2O3
InChI: InChI=1/C21H20Cl2O3/c1-21(2)17(12-18(22)23)19(21)20(24)25-13-14-7-6-10-16(11-14)26-15-8-4-3-5-9-15/h3-12,17,19H,13H2,1-2H3
46 atoms
Cl 2.013735 0.300066 -2.566426
Cl 4.282361 0.754963 -0.84616
O  -1.692404 -2.02989 1.323285
O  -1.546125 -2.4983 -0.856378
O  -2.163944 2.99354 0.313463
C  1.323624 -3.502342 -0.07753
C  1.3997 -2.12007 -0.650406
C  0.433851 -2.41612 0.489952
C  2.408902 -3.996128 0.849265
C  0.76195 -4.594726 -0.953454
C  2.542721 -1.233161 -0.408792
C  -1.013459 -2.331704 0.216476
C  2.888089 -0.204295 -1.172383
C  -3.092897 -1.756393 1.184504
C  -3.328428 -0.491175 0.409277
C  -2.632396 0.661459 0.761742
C  -4.218542 -0.466128 -0.655595
C  -2.80553 1.820651 0.020355
C  -4.410959 0.710783 -1.366576
C  -3.69826 1.85398 -1.044729
C  -0.946474 2.987518 0.950467
C  -0.76845 3.907852 1.972901
C  0.090921 2.148665 0.559703
C  0.460806 3.990023 2.612463
C  1.308008 2.230765 1.220223
C  1.500148 3.147147 2.245937
H  0.918194 -2.007761 -1.615133
H  0.727483 -2.05374 1.468171
H  3.277478 -4.331466 0.280019
H  2.741307 -3.241354 1.560548
H  2.043769 -4.846183 1.42754
H  0.245758 -5.346215 -0.353854
H  0.072058 -4.229866 -1.710096
H  1.581048 -5.094606 -1.472954
H  3.16595 -1.426334 0.455822
H  -3.610953 -2.600914 0.72682
H  -3.451614 -1.659975 2.208615
H  -1.955734 0.643993 1.607178
H  -4.75319 -1.365011 -0.935287
H  -5.104026 0.733258 -2.197135
H  -3.830157 2.766287 -1.612317
H  -1.584104 4.559236 2.260118
H  -0.040778 1.437885 -0.246798
H  0.599887 4.71394 3.404589
H  2.113854 1.571305 0.928373
H  2.454773 3.204937 2.751285
elementType: Cl O C H
totalener: -1958.43565627 hartree
nucrepener: 2634.90203468 hartree
electener: -4593.33769095 hartree
oneelecener: -7923.80724860 hartree
twoeener: 3330.46955764 hartree
cpcmener: -0.03084998 hartree
kineticenergy: 1952.56140172 hartree
xcener: -143.509512775571 hartree
chargesum: -0.0000000
charge: -0.060792 -0.066014 -0.293172 -0.488851 -0.338939 0.091622 0.024354 -0.060601 -0.280609 -0.270119 -0.191075 0.405773 0.037172 0.104750 0.023912 -0.259040 -0.232031 0.314008 -0.106221 -0.270860 0.302821 -0.260940 -0.210897 -0.112473 -0.100802 -0.213029 0.080720 0.099982 0.104298 0.094906 0.099996 0.101577 0.092791 0.097651 0.133167 0.116374 0.126757 0.142102 0.146340 0.160721 0.148326 0.147380 0.143880 0.160879 0.155045 0.159161
qa: -0.0608 -0.0660 -0.2932 -0.4889 -0.3389 0.0916 0.0244 -0.0606 -0.2806 -0.2701 -0.1911 0.4058 0.0372 0.1047 0.0239 -0.2590 -0.2320 0.3140 -0.1062 -0.2709 0.3028 -0.2609 -0.2109 -0.1125 -0.1008 -0.2130 0.0807 0.1000 0.1043 0.0949 0.1000 0.1016 0.0928 0.0977 0.1332 0.1164 0.1268 0.1421 0.1463 0.1607 0.1483 0.1474 0.1439 0.1609 0.1550 0.1592
va: 1.2606 1.2370 2.1158 2.0141 2.0746 3.7893 3.8406 3.7896 3.9146 3.8977 3.8712 4.1599 4.1933 3.7909 3.6331 3.9262 3.9529 3.6905 3.8838 4.0069 3.7227 4.0157 3.9372 3.8710 3.8005 3.9703 1.0498 1.0318 0.9997 1.0043 1.0007 0.9992 1.0200 0.9999 1.0192 1.0075 0.9932 1.0145 1.0030 0.9876 1.0068 1.0076 1.0055 0.9873 1.0048 0.9924
dispcorr: -0.025787272 hartree
energy: -1958.461443543358
dipole: -12.26367 12.63207 0.36841 -18.79278 17.53906 -1.25372 13.52923 -11.88696 1.64227
magnitude: 2.09871 au
magnitude: 5.33450 debye
