program: Orca
programVersion: 5.0.3
elementType: Cl Cl O O O C C C C C C C C C C C C C C C C C C C C C H H H H H H H H H H H H H H H H H H H H
charge: 0
multiplicity: 1
keywords: wb97x-d3
keywords: def2-TZVPP
keywords: def2/J RIJCOSX
keywords: DEFGRID2
keywords: scfconv7
keywords: smallprint printgap noloewdin
keywords: NOSOSCF
formula: C21H20Cl2O3
InChI: InChI=1/C21H20Cl2O3/c1-21(2)17(12-18(22)23)19(21)20(24)25-13-14-7-6-10-16(11-14)26-15-8-4-3-5-9-15/h3-12,17,19H,13H2,1-2H3
46 atoms
Cl 3.896466 -1.703189 1.84768
Cl 5.152271 -3.801998 0.317727
O  -1.019216 -1.427442 0.760093
O  -1.963014 -2.857955 -0.675662
O  -3.155753 3.45595 -0.039761
C  1.052532 -1.211228 -1.565993
C  1.62513 -1.859313 -0.334609
C  0.330715 -2.378509 -0.926422
C  1.664293 -1.468864 -2.921181
C  0.5135 0.191373 -1.422063
C  2.807094 -2.727237 -0.399561
C  -0.991806 -2.251228 -0.278602
C  3.808322 -2.734277 0.471442
C  -2.283322 -1.165957 1.393972
C  -3.087643 -0.160906 0.620093
C  -2.705195 1.178152 0.642968
C  -4.205946 -0.547831 -0.109627
C  -3.438315 2.115749 -0.070882
C  -4.935219 0.400636 -0.813226
C  -4.552636 1.731836 -0.806471
C  -1.85458 3.881064 0.08124
C  -1.592791 4.891062 0.995215
C  -0.845047 3.367489 -0.723268
C  -0.302994 5.39422 1.101372
C  0.442477 3.867409 -0.594645
C  0.719755 4.880444 0.315326
H  1.528043 -1.269278 0.568553
H  0.409053 -3.304314 -1.485625
H  2.540738 -0.836376 -3.071245
H  1.966126 -2.505276 -3.066082
H  0.944635 -1.227142 -3.705174
H  1.271196 0.906817 -1.746305
H  -0.366424 0.335784 -2.05199
H  0.246562 0.446503 -0.399204
H  2.872397 -3.4297 -1.222275
H  -2.838653 -2.093163 1.538319
H  -2.017485 -0.774849 2.374726
H  -1.848566 1.48079 1.234471
H  -4.513082 -1.585319 -0.122484
H  -5.806379 0.100669 -1.380672
H  -5.118052 2.472382 -1.357595
H  -2.39169 5.283218 1.612389
H  -1.057883 2.590049 -1.446564
H  -0.098721 6.185773 1.810827
H  1.231021 3.464364 -1.217592
H  1.725033 5.269502 0.407191
elementType: Cl O C H
totalener: -1958.43448482 hartree
nucrepener: 2532.67933609 hartree
electener: -4491.11382091 hartree
oneelecener: -7718.50727870 hartree
twoeener: 3227.39345778 hartree
cpcmener: -0.03152902 hartree
kineticenergy: 1952.54577760 hartree
xcener: -143.504737742783 hartree
chargesum: 0.0000000
charge: -0.058925 -0.063146 -0.275413 -0.494020 -0.342975 0.108110 0.057517 -0.102345 -0.270226 -0.312867 -0.222146 0.434040 0.041058 0.060796 0.012722 -0.253996 -0.190710 0.301089 -0.133725 -0.247445 0.286149 -0.239496 -0.213923 -0.132221 -0.149086 -0.186517 0.082615 0.098844 0.099988 0.093503 0.099742 0.107455 0.111530 0.096770 0.133072 0.119859 0.125169 0.148798 0.143845 0.160542 0.148722 0.149063 0.179412 0.161360 0.165948 0.161463
qa: -0.0589 -0.0631 -0.2754 -0.4940 -0.3430 0.1081 0.0575 -0.1023 -0.2702 -0.3129 -0.2221 0.4340 0.0411 0.0608 0.0127 -0.2540 -0.1907 0.3011 -0.1337 -0.2474 0.2861 -0.2395 -0.2139 -0.1322 -0.1491 -0.1865 0.0826 0.0988 0.1000 0.0935 0.0997 0.1075 0.1115 0.0968 0.1331 0.1199 0.1252 0.1488 0.1438 0.1605 0.1487 0.1491 0.1794 0.1614 0.1659 0.1615
va: 1.2668 1.2421 2.1298 2.0034 2.0670 3.7683 3.8326 3.8509 3.9049 3.9130 3.8885 4.1706 4.2093 3.8218 3.6191 3.9205 3.9396 3.6861 3.9245 4.0095 3.6806 4.0021 3.9043 3.8821 3.8845 3.9172 1.0407 1.0311 1.0014 1.0057 1.0004 0.9980 0.9955 1.0018 1.0179 1.0070 0.9982 1.0059 1.0133 0.9886 1.0057 1.0061 0.9817 0.9877 0.9889 0.9897
dispcorr: -0.024908804 hartree
energy: -1958.459393627597
dipole: -22.73519 23.09668 0.36149 18.66785 -17.88644 0.78141 -14.86422 14.60148 -0.26274
magnitude: 0.90017 au
magnitude: 2.28805 debye
