program: Orca
programVersion: 5.0.3
elementType: Cl Cl O O O C C C C C C C C C C C C C C C C C C C C C H H H H H H H H H H H H H H H H H H H H
charge: 0
multiplicity: 1
keywords: wb97x-d3
keywords: def2-TZVPP
keywords: def2/J RIJCOSX
keywords: DEFGRID2
keywords: scfconv7
keywords: smallprint printgap noloewdin
keywords: NOSOSCF
formula: C21H20Cl2O3
InChI: InChI=1/C21H20Cl2O3/c1-21(2)17(12-18(22)23)19(21)20(24)25-13-14-7-6-10-16(11-14)26-15-8-4-3-5-9-15/h3-12,17,19H,13H2,1-2H3
46 atoms
Cl 3.039621 -0.173117 -2.40737
Cl 4.596213 0.568096 -0.09437
O  -1.866165 -1.977813 1.303667
O  -1.522513 -2.112031 -0.899707
O  -2.554509 3.068302 0.611227
C  1.2021 -3.378087 0.058924
C  1.411363 -1.961056 -0.3915
C  0.324235 -2.276562 0.6185
C  2.1718 -4.006149 1.029801
C  0.661422 -4.361985 -0.948698
C  2.557263 -1.160688 0.056253
C  -1.090034 -2.117738 0.229297
C  3.295801 -0.375402 -0.717053
C  -3.265343 -1.776655 1.084967
C  -3.566815 -0.452943 0.440187
C  -2.892232 0.694562 0.841424
C  -4.546348 -0.368318 -0.542827
C  -3.183292 1.9078 0.233708
C  -4.851293 0.856907 -1.117112
C  -4.162619 2.001268 -0.744026
C  -1.1931 3.074988 0.785952
C  -0.33594 2.327231 -0.013058
C  -0.690425 3.916006 1.769257
C  1.032819 2.422359 0.191784
C  0.681889 4.004867 1.956743
C  1.549965 3.254349 1.175479
H  1.054704 -1.751799 -1.393652
H  0.538845 -2.007981 1.646594
H  1.710171 -4.867235 1.515509
H  3.060178 -4.359325 0.50335
H  2.495168 -3.32422 1.814846
H  1.493187 -4.867538 -1.441922
H  0.05709 -5.126264 -0.456946
H  0.056764 -3.898832 -1.724527
H  2.82137 -1.195478 1.106466
H  -3.682637 -2.59671 0.497382
H  -3.704059 -1.827265 2.081311
H  -2.137184 0.645385 1.617171
H  -5.067571 -1.261878 -0.862674
H  -5.613876 0.919734 -1.881992
H  -4.380924 2.955534 -1.205774
H  -0.718827 1.679058 -0.791046
H  -1.368694 4.496826 2.381344
H  1.696612 1.847293 -0.438774
H  1.069394 4.66063 2.725369
H  2.619174 3.318815 1.32701
elementType: Cl O C H
totalener: -1958.43653422 hartree
nucrepener: 2611.67235618 hartree
electener: -4570.10889040 hartree
oneelecener: -7877.30502914 hartree
twoeener: 3307.19613874 hartree
cpcmener: -0.03067711 hartree
kineticenergy: 1952.55827310 hartree
xcener: -143.508622048092 hartree
chargesum: 0.0000000
charge: -0.065129 -0.063924 -0.294371 -0.488403 -0.343915 0.084181 0.048636 -0.072878 -0.262782 -0.269797 -0.223522 0.411324 0.050272 0.111077 0.024990 -0.228725 -0.217783 0.261768 -0.120524 -0.247123 0.304291 -0.202059 -0.259947 -0.139330 -0.113068 -0.213661 0.080081 0.098065 0.098529 0.100869 0.091270 0.097897 0.102476 0.093315 0.134686 0.118319 0.124384 0.145385 0.145949 0.161195 0.150155 0.150697 0.147304 0.178048 0.160561 0.151217
qa: -0.0651 -0.0639 -0.2944 -0.4884 -0.3439 0.0842 0.0486 -0.0729 -0.2628 -0.2698 -0.2235 0.4113 0.0503 0.1111 0.0250 -0.2287 -0.2178 0.2618 -0.1205 -0.2471 0.3043 -0.2021 -0.2599 -0.1393 -0.1131 -0.2137 0.0801 0.0981 0.0985 0.1009 0.0913 0.0979 0.1025 0.0933 0.1347 0.1183 0.1244 0.1454 0.1459 0.1612 0.1502 0.1507 0.1473 0.1780 0.1606 0.1512
va: 1.2584 1.2387 2.1211 2.0103 2.0612 3.7586 3.8272 3.8333 3.9105 3.9020 3.9039 4.1400 4.1864 3.7806 3.6106 3.9314 3.9537 3.7148 3.8889 4.0121 3.6707 3.9075 4.0111 3.8364 3.8948 3.9370 1.0481 1.0341 1.0011 1.0007 1.0055 1.0002 0.9990 1.0192 1.0173 1.0081 0.9925 1.0143 1.0020 0.9879 1.0045 1.0069 1.0078 0.9728 0.9879 0.9998
dispcorr: -0.025504863 hartree
energy: -1958.462039084827
dipole: -17.37900 17.29831 -0.08069 -16.39939 14.97174 -1.42764 9.68334 -8.25178 1.43155
magnitude: 2.02337 au
magnitude: 5.14300 debye
