program: Orca
programVersion: 5.0.3
elementType: Cl Cl O O O C C C C C C C C C C C C C C C C C C C C C H H H H H H H H H H H H H H H H H H H H
charge: 0
multiplicity: 1
keywords: wb97x-d3
keywords: def2-TZVPP
keywords: def2/J RIJCOSX
keywords: DEFGRID2
keywords: scfconv7
keywords: smallprint printgap noloewdin
keywords: NOSOSCF
formula: C21H20Cl2O3
InChI: InChI=1/C21H20Cl2O3/c1-21(2)17(12-18(22)23)19(21)20(24)25-13-14-7-6-10-16(11-14)26-15-8-4-3-5-9-15/h3-12,17,19H,13H2,1-2H3
46 atoms
Cl 5.163194 -3.543337 -1.013811
Cl 4.365513 -6.310751 -0.847372
O  -0.506563 -1.46804 1.248436
O  1.314489 -0.443644 0.454045
O  -1.852392 4.38748 1.427563
C  0.866777 -2.594914 -1.816403
C  2.063181 -2.945428 -0.97665
C  0.740565 -2.642285 -0.305439
C  0.133196 -3.674076 -2.574301
C  0.880842 -1.273652 -2.544563
C  2.579311 -4.317945 -0.909179
C  0.584114 -1.406304 0.483682
C  3.859656 -4.66501 -0.922273
C  -0.859651 -0.30489 1.992651
C  -1.416654 0.794218 1.128822
C  -1.39883 2.092204 1.626689
C  -2.002737 0.544174 -0.10718
C  -1.954715 3.128823 0.893296
C  -2.541526 1.594598 -0.838152
C  -2.523394 2.89216 -0.352107
C  -2.880004 5.285172 1.274255
C  -4.214217 4.911535 1.382415
C  -2.530688 6.611765 1.065245
C  -5.199571 5.881474 1.265796
C  -3.526971 7.572627 0.963813
C  -4.864307 7.212685 1.055355
H  2.804015 -2.15768 -0.900777
H  0.185446 -3.49322 0.073026
H  0.040835 -4.604008 -2.015519
H  -0.875937 -3.337954 -2.817192
H  0.643936 -3.894109 -3.513308
H  1.247929 -1.425139 -3.560826
H  -0.127102 -0.860657 -2.617492
H  1.519505 -0.528078 -2.077295
H  1.858827 -5.124464 -0.840765
H  -1.618315 -0.648034 2.696265
H  -0.011189 0.054999 2.577996
H  -0.945747 2.300244 2.589432
H  -2.044503 -0.45752 -0.514499
H  -2.984568 1.399561 -1.805876
H  -2.941435 3.698739 -0.940329
H  -4.491201 3.879951 1.558828
H  -1.487437 6.890474 0.987918
H  -6.238447 5.589706 1.34676
H  -3.251315 8.606636 0.803249
H  -5.638911 7.96269 0.96778
elementType: Cl O C H
totalener: -1958.43624537 hartree
nucrepener: 2385.77856263 hartree
electener: -4344.21480800 hartree
oneelecener: -7425.40041512 hartree
twoeener: 3081.18560713 hartree
cpcmener: -0.03276087 hartree
kineticenergy: 1952.54915766 hartree
xcener: -143.506713599504 hartree
chargesum: -0.0000000
charge: -0.058162 -0.062478 -0.294413 -0.481096 -0.340366 0.093945 0.023914 -0.061826 -0.266180 -0.267509 -0.201250 0.387618 0.037302 0.100166 0.053376 -0.280656 -0.254216 0.283833 -0.127008 -0.206712 0.287521 -0.191907 -0.251161 -0.150356 -0.126266 -0.188642 0.078208 0.099180 0.092677 0.098548 0.100992 0.102516 0.095563 0.096186 0.132931 0.127231 0.119856 0.132636 0.152633 0.161790 0.158803 0.158984 0.148253 0.162741 0.161296 0.161504
qa: -0.0582 -0.0625 -0.2944 -0.4811 -0.3404 0.0939 0.0239 -0.0618 -0.2662 -0.2675 -0.2012 0.3876 0.0373 0.1002 0.0534 -0.2807 -0.2542 0.2838 -0.1270 -0.2067 0.2875 -0.1919 -0.2512 -0.1504 -0.1263 -0.1886 0.0782 0.0992 0.0927 0.0985 0.1010 0.1025 0.0956 0.0962 0.1329 0.1272 0.1199 0.1326 0.1526 0.1618 0.1588 0.1590 0.1483 0.1627 0.1613 0.1615
va: 1.2673 1.2424 2.1186 2.0162 2.0577 3.7231 3.8969 3.8189 3.9060 3.8946 3.8921 4.1847 4.2060 3.7818 3.6278 4.0992 3.9398 3.7104 3.8962 3.9262 3.6749 3.9018 4.0028 3.8883 3.8812 3.8972 1.0492 1.0335 1.0053 1.0014 1.0010 1.0020 1.0023 1.0175 1.0170 0.9916 1.0119 1.0188 1.0074 0.9906 0.9953 0.9961 1.0075 0.9892 0.9880 0.9893
dispcorr: -0.022061677 hartree
energy: -1958.458307043629
dipole: -35.89490 33.52465 -2.37025 26.22353 -26.67761 -0.45408 -4.85946 4.45098 -0.40847
magnitude: 2.44768 au
magnitude: 6.22150 debye
