program: Orca
programVersion: 5.0.3
elementType: Cl Cl O O O C C C C C C C C C C C C C C C C C C C C C H H H H H H H H H H H H H H H H H H H H
charge: 0
multiplicity: 1
keywords: wb97x-d3
keywords: def2-TZVPP
keywords: def2/J RIJCOSX
keywords: DEFGRID2
keywords: scfconv7
keywords: smallprint printgap noloewdin
keywords: NOSOSCF
formula: C21H20Cl2O3
InChI: InChI=1/C21H20Cl2O3/c1-21(2)17(12-18(22)23)19(21)20(24)25-13-14-7-6-10-16(11-14)26-15-8-4-3-5-9-15/h3-12,17,19H,13H2,1-2H3
46 atoms
Cl 1.261318 0.422259 1.908857
Cl 4.131048 0.590711 1.654184
O  -1.42231 -1.945627 0.115012
O  -1.137516 -3.615555 1.566485
O  -1.965837 2.964103 -0.583393
C  1.272251 -2.928811 -1.061326
C  1.364661 -1.630729 -0.336197
C  0.740194 -2.825102 0.360548
C  2.512825 -3.77307 -1.219277
C  0.330659 -3.031538 -2.236202
C  2.63592 -1.069622 0.163194
C  -0.686846 -2.850778 0.741495
C  2.674394 -0.144979 1.112524
C  -2.788089 -1.757331 0.493511
C  -3.227439 -0.449647 -0.098703
C  -2.37861 0.651162 -0.041796
C  -4.480359 -0.323301 -0.685726
C  -2.770789 1.855104 -0.606898
C  -4.878224 0.899846 -1.209831
C  -4.024605 1.991392 -1.188534
C  -0.601072 2.809779 -0.676536
C  -0.023712 1.956295 -1.609854
C  0.187236 3.581042 0.163018
C  1.358376 1.868129 -1.67996
C  1.569813 3.490639 0.072891
C  2.160531 2.63068 -0.84083
H  0.652579 -0.875213 -0.656113
H  1.35726 -3.323949 1.099206
H  3.100421 -3.432863 -2.073986
H  3.155504 -3.748665 -0.339178
H  2.241726 -4.814459 -1.3992
H  -0.502315 -2.334696 -2.181175
H  0.874279 -2.813538 -3.156997
H  -0.074216 -4.04089 -2.324707
H  3.573145 -1.388837 -0.277407
H  -3.401761 -2.580816 0.123287
H  -2.87297 -1.734716 1.582528
H  -1.409409 0.567335 0.433448
H  -5.142814 -1.177944 -0.739743
H  -5.854999 0.998365 -1.664504
H  -4.323638 2.937477 -1.621279
H  -0.638995 1.362157 -2.273784
H  -0.277076 4.243529 0.882536
H  1.808616 1.197652 -2.400437
H  2.184911 4.090077 0.731019
H  3.237716 2.551765 -0.898664
elementType: Cl O C H
totalener: -1958.43237862 hartree
nucrepener: 2716.64007357 hartree
electener: -4675.07245219 hartree
oneelecener: -8086.55777680 hartree
twoeener: 3411.48532461 hartree
cpcmener: -0.03038271 hartree
kineticenergy: 1952.56790950 hartree
xcener: -143.513051397289 hartree
chargesum: -0.0000000
charge: -0.055073 -0.064980 -0.271281 -0.497977 -0.343673 0.143288 -0.031424 -0.088799 -0.291036 -0.270316 -0.207144 0.418802 0.091925 0.066949 0.005930 -0.192858 -0.229300 0.297907 -0.107724 -0.263284 0.287418 -0.187388 -0.230783 -0.163684 -0.146641 -0.160608 0.087257 0.102003 0.102792 0.092181 0.100121 0.090015 0.096159 0.103437 0.142468 0.118728 0.120326 0.101159 0.144884 0.160630 0.147710 0.158358 0.147854 0.165080 0.155796 0.154798
qa: -0.0551 -0.0650 -0.2713 -0.4980 -0.3437 0.1433 -0.0314 -0.0888 -0.2910 -0.2703 -0.2071 0.4188 0.0919 0.0669 0.0059 -0.1929 -0.2293 0.2979 -0.1077 -0.2633 0.2874 -0.1874 -0.2308 -0.1637 -0.1466 -0.1606 0.0873 0.1020 0.1028 0.0922 0.1001 0.0900 0.0962 0.1034 0.1425 0.1187 0.1203 0.1012 0.1449 0.1606 0.1477 0.1584 0.1479 0.1651 0.1558 0.1548
va: 1.2844 1.2409 2.1128 2.0028 2.0664 3.7806 3.8405 3.8822 3.9221 3.8863 3.8710 4.1191 4.1698 3.8143 3.7300 3.8949 3.9514 3.6958 3.8850 4.0091 3.6620 3.8601 3.9809 3.8342 3.8855 3.8001 1.0073 1.0250 0.9983 1.0008 1.0020 1.0131 1.0011 0.9997 1.0094 0.9999 1.0002 1.0438 1.0029 0.9876 1.0068 0.9960 1.0049 0.9882 0.9910 0.9964
dispcorr: -0.029757364 hartree
energy: -1958.462135984453
dipole: -9.79118 10.25404 0.46286 -14.47379 14.15375 -0.32004 -20.93765 19.22870 -1.70895
magnitude: 1.79922 au
magnitude: 4.57325 debye
