program: Orca
programVersion: 5.0.3
elementType: Cl Cl O O O C C C C C C C C C C C C C C C C C C C C C H H H H H H H H H H H H H H H H H H H H
charge: 0
multiplicity: 1
keywords: wb97x-d3
keywords: def2-TZVPP
keywords: def2/J RIJCOSX
keywords: DEFGRID2
keywords: scfconv7
keywords: smallprint printgap noloewdin
keywords: NOSOSCF
formula: C21H20Cl2O3
InChI: InChI=1/C21H20Cl2O3/c1-21(2)17(12-18(22)23)19(21)20(24)25-13-14-7-6-10-16(11-14)26-15-8-4-3-5-9-15/h3-12,17,19H,13H2,1-2H3
46 atoms
Cl 4.031426 -3.283465 1.300146
Cl 4.951366 -4.100644 -1.308772
O  -1.722721 -1.414387 -0.949151
O  -0.721416 -1.380926 1.056588
O  -2.822553 3.511726 -0.105037
C  1.577998 -0.188017 -0.771695
C  1.920976 -1.56964 -0.290105
C  0.583433 -1.318739 -0.952454
C  2.205678 0.35067 -2.033709
C  1.343586 0.8775 0.269959
C  2.903477 -2.405983 -0.988945
C  -0.654245 -1.379263 -0.150159
C  3.828779 -3.156293 -0.4048
C  -3.028425 -1.427913 -0.376427
C  -3.650279 -0.057675 -0.340352
C  -2.888944 1.100464 -0.236414
C  -5.038654 0.03491 -0.387313
C  -3.523369 2.334939 -0.160574
C  -5.657083 1.273254 -0.320853
C  -4.905718 2.432431 -0.200531
C  -1.654118 3.59364 0.611489
C  -1.50827 3.006976 1.862902
C  -0.63114 4.352175 0.060256
C  -0.320743 3.184526 2.557987
C  0.545804 4.531757 0.773395
C  0.709465 3.945098 2.020462
H  1.881357 -1.691053 0.786269
H  0.47455 -1.665491 -1.973892
H  3.204324 0.739105 -1.827027
H  2.291429 -0.394918 -2.822887
H  1.60549 1.173376 -2.425545
H  2.272577 1.421817 0.446416
H  0.600477 1.598549 -0.076527
H  1.0142 0.479176 1.226679
H  2.879945 -2.416661 -2.072157
H  -3.622993 -2.088506 -1.006416
H  -3.009242 -1.863081 0.624436
H  -1.807095 1.061415 -0.221411
H  -5.636133 -0.863386 -0.482489
H  -6.736163 1.339747 -0.362111
H  -5.384669 3.401649 -0.14886
H  -2.308065 2.422318 2.299489
H  -0.759964 4.804664 -0.914845
H  -0.205844 2.726642 3.531731
H  1.341452 5.125601 0.343006
H  1.631713 4.078343 2.56988
elementType: Cl O C H
totalener: -1958.43675624 hartree
nucrepener: 2539.80262085 hartree
electener: -4498.23937709 hartree
oneelecener: -7733.25090138 hartree
twoeener: 3235.01152429 hartree
cpcmener: -0.03031119 hartree
kineticenergy: 1952.54627814 hartree
xcener: -143.508939538880 hartree
chargesum: 0.0000000
charge: -0.058391 -0.062705 -0.285951 -0.478193 -0.339430 0.128464 0.026604 -0.081353 -0.274103 -0.289934 -0.204427 0.389408 0.038771 0.084793 0.015361 -0.196540 -0.220972 0.261930 -0.117571 -0.252169 0.272446 -0.184830 -0.218102 -0.156290 -0.141734 -0.176977 0.077078 0.099004 0.102041 0.094450 0.100602 0.111657 0.066408 0.102960 0.133359 0.122085 0.114314 0.165345 0.142336 0.160476 0.147301 0.156757 0.146244 0.161302 0.159181 0.158996
qa: -0.0584 -0.0627 -0.2860 -0.4782 -0.3394 0.1285 0.0266 -0.0814 -0.2741 -0.2899 -0.2044 0.3894 0.0388 0.0848 0.0154 -0.1965 -0.2210 0.2619 -0.1176 -0.2522 0.2724 -0.1848 -0.2181 -0.1563 -0.1417 -0.1770 0.0771 0.0990 0.1020 0.0945 0.1006 0.1117 0.0664 0.1030 0.1334 0.1221 0.1143 0.1653 0.1423 0.1605 0.1473 0.1568 0.1462 0.1613 0.1592 0.1590
va: 1.2673 1.2423 2.1221 2.0186 2.0680 3.7218 3.8866 3.8497 3.9053 3.8963 3.8995 4.2077 4.2053 3.8336 3.6854 3.9307 3.9501 3.7618 3.8902 3.9995 3.6820 3.8764 3.9497 3.8365 3.8668 3.8391 1.0506 1.0335 1.0009 1.0054 0.9998 1.0012 1.0072 1.0133 1.0169 0.9953 1.0128 0.9607 1.0021 0.9880 1.0069 0.9964 1.0075 0.9904 0.9894 0.9908
dispcorr: -0.025420619 hartree
energy: -1958.462176855161
dipole: -22.16584 21.55271 -0.61313 27.96344 -27.54160 0.42184 -2.49289 1.37153 -1.12135
magnitude: 1.34585 au
magnitude: 3.42088 debye
