program: Orca
programVersion: 5.0.3
elementType: Cl Cl O O O C C C C C C C C C C C C C C C C C C C C C H H H H H H H H H H H H H H H H H H H H
charge: 0
multiplicity: 1
keywords: wb97x-d3
keywords: def2-TZVPP
keywords: def2/J RIJCOSX
keywords: DEFGRID2
keywords: scfconv7
keywords: smallprint printgap noloewdin
keywords: NOSOSCF
formula: C21H20Cl2O3
InChI: InChI=1/C21H20Cl2O3/c1-21(2)17(12-18(22)23)19(21)20(24)25-13-14-7-6-10-16(11-14)26-15-8-4-3-5-9-15/h3-12,17,19H,13H2,1-2H3
46 atoms
Cl 1.784335 0.566982 -0.436911
Cl 4.647279 0.238125 -0.330455
O  -1.40847 -1.961758 0.974639
O  -1.288845 -2.352241 -1.22376
O  -1.911776 2.869989 -0.67074
C  1.378756 -3.793376 -0.32298
C  1.681918 -2.490515 -0.9797
C  0.673745 -2.524706 0.142572
C  2.373993 -4.363583 0.658049
C  0.635907 -4.849349 -1.101781
C  2.981781 -1.813986 -0.775501
C  -0.750038 -2.277501 -0.143863
C  3.113805 -0.516852 -0.542597
C  -2.813085 -1.750254 0.889184
C  -3.203428 -0.445614 0.248552
C  -2.306922 0.605638 0.102353
C  -4.526784 -0.287273 -0.151797
C  -2.745516 1.810388 -0.435684
C  -4.950117 0.919094 -0.685914
C  -4.066139 1.977307 -0.827579
C  -0.815095 3.122685 0.113062
C  0.297842 3.643764 -0.532777
C  -0.817533 2.950286 1.49225
C  1.417996 3.991253 0.207836
C  0.316174 3.289262 2.217304
C  1.436386 3.809442 1.583268
H  1.256191 -2.357627 -1.971427
H  1.007082 -2.153031 1.104669
H  2.873198 -3.593341 1.24626
H  1.875782 -5.039086 1.354947
H  3.141726 -4.936662 0.134984
H  1.353258 -5.521521 -1.575503
H  0.008976 -5.45139 -0.442105
H  0.006897 -4.441029 -1.889331
H  3.88532 -2.409487 -0.842268
H  -3.297756 -2.58484 0.378161
H  -3.154614 -1.763664 1.924601
H  -1.274122 0.491592 0.405461
H  -5.225372 -1.107949 -0.044626
H  -5.979688 1.040469 -0.995572
H  -4.391523 2.919912 -1.248466
H  0.28331 3.7798 -1.606715
H  -1.688634 2.562636 2.004418
H  2.283548 4.396984 -0.299068
H  0.315262 3.150759 3.29047
H  2.314631 4.072408 2.157426
elementType: Cl O C H
totalener: -1958.43381840 hartree
nucrepener: 2649.02085632 hartree
electener: -4607.45467473 hartree
oneelecener: -7952.73541045 hartree
twoeener: 3345.28073572 hartree
cpcmener: -0.03149392 hartree
kineticenergy: 1952.56407287 hartree
xcener: -143.511407772567 hartree
chargesum: -0.0000000
charge: -0.047141 -0.061066 -0.296198 -0.482936 -0.333710 0.130156 -0.015826 -0.129732 -0.283061 -0.273251 -0.230363 0.409206 0.083083 0.098229 0.018370 -0.243492 -0.254308 0.363241 -0.101998 -0.280009 0.329440 -0.288709 -0.217736 -0.113003 -0.139301 -0.190952 0.108780 0.113248 0.095244 0.100435 0.102676 0.097928 0.102327 0.092328 0.141152 0.118599 0.130498 0.108891 0.143783 0.160495 0.146714 0.143752 0.160544 0.158951 0.163179 0.161545
qa: -0.0471 -0.0611 -0.2962 -0.4829 -0.3337 0.1302 -0.0158 -0.1297 -0.2831 -0.2733 -0.2304 0.4092 0.0831 0.0982 0.0184 -0.2435 -0.2543 0.3632 -0.1020 -0.2800 0.3294 -0.2887 -0.2177 -0.1130 -0.1393 -0.1910 0.1088 0.1132 0.0952 0.1004 0.1027 0.0979 0.1023 0.0923 0.1412 0.1186 0.1305 0.1089 0.1438 0.1605 0.1467 0.1438 0.1605 0.1590 0.1632 0.1615
va: 1.3084 1.2467 2.1133 2.0160 2.0770 3.7223 3.8690 3.8126 3.9153 3.8927 3.9117 4.1208 4.1786 3.7793 3.6799 3.9344 3.9817 3.6178 3.8728 4.0132 3.5956 3.9520 3.8968 3.8352 3.8778 3.8938 1.0242 1.0251 0.9985 1.0022 0.9996 1.0012 0.9989 1.0179 1.0080 1.0104 0.9901 1.0362 1.0011 0.9875 1.0081 1.0117 0.9948 0.9882 0.9883 0.9881
dispcorr: -0.025884949 hartree
energy: -1958.459703350305
dipole: -13.72007 14.04899 0.32892 -18.81104 17.38271 -1.42833 4.93984 -3.60468 1.33516
magnitude: 1.98267 au
magnitude: 5.03954 debye
