program: Orca
programVersion: 5.0.3
elementType: Cl Cl O O O C C C C C C C C C C C C C C C C C C C C C H H H H H H H H H H H H H H H H H H H H
charge: 0
multiplicity: 1
keywords: wb97x-d3
keywords: def2-TZVPP
keywords: def2/J RIJCOSX
keywords: DEFGRID2
keywords: scfconv7
keywords: smallprint printgap noloewdin
keywords: NOSOSCF
formula: C21H20Cl2O3
InChI: InChI=1/C21H20Cl2O3/c1-21(2)17(12-18(22)23)19(21)20(24)25-13-14-7-6-10-16(11-14)26-15-8-4-3-5-9-15/h3-12,17,19H,13H2,1-2H3
46 atoms
Cl 4.848253 -1.5068 0.337152
Cl 5.141727 -4.341222 -0.109718
O  -1.56392 -1.982964 0.81754
O  -0.121687 -0.272956 0.837329
O  -3.495184 3.415464 0.184457
C  0.908939 -1.794436 -1.728166
C  1.864434 -1.957893 -0.579394
C  0.394954 -2.267311 -0.382378
C  0.889865 -2.81464 -2.839693
C  0.620388 -0.394701 -2.213626
C  2.822689 -3.068727 -0.52393
C  -0.421729 -1.388581 0.478582
C  4.09202 -2.97522 -0.148832
C  -2.527468 -1.213037 1.553835
C  -3.199699 -0.211721 0.658956
C  -3.022628 1.148484 0.869745
C  -3.982803 -0.652024 -0.405587
C  -3.610545 2.061308 0.002643
C  -4.576588 0.268294 -1.254053
C  -4.386394 1.629661 -1.061798
C  -2.291408 3.970129 0.537811
C  -2.347129 5.123235 1.309892
C  -1.069726 3.462168 0.110145
C  -1.171379 5.772938 1.655442
C  0.09867 4.118205 0.47391
C  0.057028 5.272302 1.244497
H  2.196952 -1.026587 -0.135496
H  0.120928 -3.315672 -0.344202
H  1.003878 -3.837825 -2.484523
H  -0.056036 -2.75995 -3.380489
H  1.6909 -2.615088 -3.553446
H  1.302722 -0.144516 -3.027394
H  -0.396666 -0.325247 -2.604154
H  0.740244 0.364976 -1.444689
H  2.470384 -4.054173 -0.804771
H  -3.23992 -1.949647 1.920731
H  -2.062643 -0.734097 2.416463
H  -2.421221 1.490083 1.703664
H  -4.130964 -1.712486 -0.567635
H  -5.187489 -0.072107 -2.079547
H  -4.839763 2.351873 -1.728822
H  -3.30644 5.509406 1.631472
H  -1.016969 2.570009 -0.501415
H  -1.220093 6.671993 2.255876
H  1.049559 3.720942 0.14302
H  0.97315 5.777189 1.520402
elementType: Cl O C H
totalener: -1958.43612669 hartree
nucrepener: 2496.93664558 hartree
electener: -4455.37277228 hartree
oneelecener: -7648.00531305 hartree
twoeener: 3192.63254077 hartree
cpcmener: -0.03012447 hartree
kineticenergy: 1952.55154029 hartree
xcener: -143.504966900743 hartree
chargesum: 0.0000000
charge: -0.058437 -0.062661 -0.286766 -0.491920 -0.340942 0.094509 0.030547 -0.086465 -0.265414 -0.265142 -0.204710 0.420033 0.037829 0.091724 0.003826 -0.195451 -0.244201 0.284424 -0.115969 -0.250729 0.309775 -0.257753 -0.206503 -0.123205 -0.154785 -0.190610 0.077933 0.099913 0.092377 0.098218 0.100821 0.100921 0.100004 0.086667 0.133679 0.129628 0.116547 0.146769 0.144677 0.161962 0.149338 0.146702 0.159483 0.160890 0.161153 0.161310
qa: -0.0584 -0.0627 -0.2868 -0.4919 -0.3409 0.0945 0.0305 -0.0865 -0.2654 -0.2651 -0.2047 0.4200 0.0378 0.0917 0.0038 -0.1955 -0.2442 0.2844 -0.1160 -0.2507 0.3098 -0.2578 -0.2065 -0.1232 -0.1548 -0.1906 0.0779 0.0999 0.0924 0.0982 0.1008 0.1009 0.1000 0.0867 0.1337 0.1296 0.1165 0.1468 0.1447 0.1620 0.1493 0.1467 0.1595 0.1609 0.1612 0.1613
va: 1.2671 1.2424 2.1259 2.0099 2.0686 3.7257 3.8703 3.8351 3.9054 3.9104 3.8926 4.1670 4.2075 3.7973 3.6067 3.9074 3.9658 3.7022 3.8801 4.0206 3.6771 3.9977 3.8913 3.8804 3.8954 3.9023 1.0487 1.0330 1.0052 1.0013 1.0010 1.0016 0.9995 1.0155 1.0164 0.9931 1.0095 1.0112 1.0069 0.9874 1.0053 1.0086 0.9926 0.9879 0.9899 0.9893
dispcorr: -0.023207415 hartree
energy: -1958.459334109666
dipole: -28.98219 27.89756 -1.08463 13.97080 -15.11647 -1.14567 -10.63456 9.85634 -0.77822
magnitude: 1.75915 au
magnitude: 4.47140 debye
