program: Orca
programVersion: 5.0.3
elementType: Cl Cl O O O C C C C C C C C C C C C C C C C C C C C C H H H H H H H H H H H H H H H H H H H H
charge: 0
multiplicity: 1
keywords: wb97x-d3
keywords: def2-TZVPP
keywords: def2/J RIJCOSX
keywords: DEFGRID2
keywords: scfconv7
keywords: smallprint printgap noloewdin
keywords: NOSOSCF
formula: C21H20Cl2O3
InChI: InChI=1/C21H20Cl2O3/c1-21(2)17(12-18(22)23)19(21)20(24)25-13-14-7-6-10-16(11-14)26-15-8-4-3-5-9-15/h3-12,17,19H,13H2,1-2H3
46 atoms
Cl 3.379979 -3.800755 1.623987
Cl 4.765313 -4.66409 -0.753819
O  -1.720431 -1.567157 -1.619479
O  -1.084756 -1.795436 0.511858
O  -2.14122 3.33535 -0.604702
C  1.528275 -0.574006 -0.888897
C  1.743582 -1.958138 -0.337056
C  0.557121 -1.685956 -1.23104
C  2.388081 -0.068958 -2.021369
C  1.134373 0.511926 0.083457
C  2.80884 -2.837382 -0.832226
C  -0.804118 -1.700014 -0.65974
C  3.547891 -3.645636 -0.082935
C  -3.079893 -1.406461 -1.211768
C  -3.310651 -0.104972 -0.494946
C  -2.604423 1.039532 -0.853493
C  -4.248234 -0.037356 0.527575
C  -2.837969 2.228872 -0.184124
C  -4.484693 1.165866 1.178854
C  -3.781216 2.308427 0.832777
C  -1.519744 4.129202 0.325307
C  -1.459025 5.488532 0.050051
C  -0.926551 3.60888 1.469508
C  -0.800828 6.334218 0.931069
C  -0.280393 4.469641 2.346127
C  -0.215426 5.831877 2.085471
H  1.505043 -2.060398 0.71541
H  0.620069 -2.04165 -2.253701
H  2.601899 -0.830461 -2.769951
H  1.887141 0.755923 -2.530609
H  3.339497 0.306554 -1.640902
H  2.030986 0.991098 0.48013
H  0.545304 1.282645 -0.417723
H  0.56041 0.144474 0.931749
H  3.007842 -2.843656 -1.897304
H  -3.649166 -1.438451 -2.140752
H  -3.403208 -2.249529 -0.59799
H  -1.864663 1.018071 -1.644838
H  -4.791152 -0.926889 0.82209
H  -5.219288 1.213629 1.971788
H  -3.9659 3.243323 1.346509
H  -1.921128 5.878153 -0.848268
H  -0.96066 2.547449 1.68131
H  -0.755006 7.393529 0.714519
H  0.17858 4.06593 3.239175
H  0.288886 6.495484 2.774914
elementType: Cl O C H
totalener: -1958.43633388 hartree
nucrepener: 2503.90184098 hartree
electener: -4462.33817485 hartree
oneelecener: -7661.70506537 hartree
twoeener: 3199.36689051 hartree
cpcmener: -0.03153621 hartree
kineticenergy: 1952.55589968 hartree
xcener: -143.507445131003 hartree
chargesum: 0.0000000
charge: -0.058792 -0.063114 -0.289728 -0.475585 -0.346485 0.111364 0.020515 -0.068710 -0.269140 -0.279802 -0.205160 0.390823 0.038992 0.097144 0.039052 -0.295857 -0.212478 0.263540 -0.133436 -0.182836 0.302168 -0.250159 -0.188768 -0.131399 -0.173092 -0.182068 0.075395 0.102754 0.093113 0.098456 0.101251 0.108314 0.088401 0.098481 0.133998 0.124899 0.120472 0.140648 0.145578 0.162297 0.160255 0.147914 0.157747 0.160681 0.161217 0.161141
qa: -0.0588 -0.0631 -0.2897 -0.4756 -0.3465 0.1114 0.0205 -0.0687 -0.2691 -0.2798 -0.2052 0.3908 0.0390 0.0971 0.0391 -0.2959 -0.2125 0.2635 -0.1334 -0.1828 0.3022 -0.2502 -0.1888 -0.1314 -0.1731 -0.1821 0.0754 0.1028 0.0931 0.0985 0.1013 0.1083 0.0884 0.0985 0.1340 0.1249 0.1205 0.1406 0.1456 0.1623 0.1603 0.1479 0.1577 0.1607 0.1612 0.1611
va: 1.2667 1.2417 2.1165 2.0239 2.0362 3.7393 3.8979 3.8085 3.9017 3.8946 3.8987 4.2029 4.2051 3.7845 3.6110 4.0136 3.9690 3.7283 3.8903 3.9244 3.6361 4.0066 3.8671 3.8897 3.9207 3.8918 1.0515 1.0314 1.0053 1.0020 1.0009 1.0026 1.0031 1.0146 1.0168 0.9929 1.0079 1.0224 1.0017 0.9888 0.9943 1.0077 0.9954 0.9881 0.9905 0.9890
dispcorr: -0.024217745 hartree
energy: -1958.460551623522
dipole: -20.34071 19.74613 -0.59458 32.88702 -31.94659 0.94043 -3.69774 2.72207 -0.97567
magnitude: 1.47982 au
magnitude: 3.76140 debye
