program: Orca
programVersion: 5.0.3
elementType: Cl Cl O O O C C C C C C C C C C C C C C C C C C C C C H H H H H H H H H H H H H H H H H H H H
charge: 0
multiplicity: 1
keywords: wb97x-d3
keywords: def2-TZVPP
keywords: def2/J RIJCOSX
keywords: DEFGRID2
keywords: scfconv7
keywords: smallprint printgap noloewdin
keywords: NOSOSCF
formula: C21H20Cl2O3
InChI: InChI=1/C21H20Cl2O3/c1-21(2)17(12-18(22)23)19(21)20(24)25-13-14-7-6-10-16(11-14)26-15-8-4-3-5-9-15/h3-12,17,19H,13H2,1-2H3
46 atoms
Cl 3.232614 -0.49467 2.033455
Cl 3.20786 -2.985126 3.488456
O  -1.767436 -2.020773 -1.29167
O  -0.238668 -0.436998 -1.6878
O  -2.677101 3.462604 0.187279
C  1.766168 -2.838426 -1.530246
C  1.734225 -2.122435 -0.212404
C  0.43487 -2.580014 -0.85767
C  2.198952 -4.283656 -1.589979
C  2.190585 -2.049844 -2.744834
C  2.149679 -2.760369 1.040772
C  -0.519699 -1.557044 -1.326683
C  2.779727 -2.155845 2.040144
C  -2.835251 -1.113243 -1.609832
C  -3.046973 -0.12365 -0.500106
C  -2.782446 1.223087 -0.706388
C  -3.478185 -0.560398 0.750004
C  -2.917659 2.12146 0.344065
C  -3.634177 0.349404 1.783625
C  -3.343953 1.693301 1.591578
C  -1.60417 3.886904 -0.556271
C  -1.763494 5.076343 -1.253859
C  -0.391136 3.207634 -0.581219
C  -0.700164 5.589112 -1.982706
C  0.659019 3.727136 -1.3252
C  0.512546 4.915083 -2.029046
H  1.915431 -1.055745 -0.278599
H  -0.0282 -3.456623 -0.419533
H  1.807635 -4.883088 -0.769086
H  1.8517 -4.738885 -2.518709
H  3.287611 -4.356582 -1.571609
H  2.011746 -0.981903 -2.650996
H  3.260679 -2.188534 -2.907136
H  1.673793 -2.405432 -3.637882
H  1.914744 -3.809014 1.178492
H  -2.64683 -0.614326 -2.561343
H  -3.705958 -1.755169 -1.732323
H  -2.45878 1.561699 -1.682939
H  -3.694385 -1.608668 0.915067
H  -3.974381 0.012696 2.753863
H  -3.449107 2.403139 2.402077
H  -2.711646 5.597931 -1.220806
H  -0.255301 2.285479 -0.030778
H  -0.827538 6.517779 -2.523382
H  1.601254 3.195287 -1.347135
H  1.336737 5.312536 -2.605988
elementType: Cl O C H
totalener: -1958.43565730 hartree
nucrepener: 2529.14928612 hartree
electener: -4487.58494343 hartree
oneelecener: -7712.74041900 hartree
twoeener: 3225.15547558 hartree
cpcmener: -0.03009852 hartree
kineticenergy: 1952.55946425 hartree
xcener: -143.506429517930 hartree
chargesum: -0.0000000
charge: -0.058577 -0.062724 -0.289817 -0.499218 -0.342630 0.091108 0.020247 -0.074023 -0.269636 -0.271510 -0.199834 0.429554 0.040298 0.093638 0.006342 -0.192850 -0.246554 0.283166 -0.113878 -0.252399 0.306435 -0.261014 -0.202694 -0.121075 -0.144358 -0.195796 0.082710 0.095566 0.093897 0.098618 0.100825 0.093706 0.097060 0.101584 0.131982 0.117321 0.130676 0.144023 0.145278 0.160915 0.149252 0.147476 0.152709 0.161151 0.161538 0.161515
qa: -0.0586 -0.0627 -0.2898 -0.4992 -0.3426 0.0911 0.0202 -0.0740 -0.2696 -0.2715 -0.1998 0.4296 0.0403 0.0936 0.0063 -0.1929 -0.2466 0.2832 -0.1139 -0.2524 0.3064 -0.2610 -0.2027 -0.1211 -0.1444 -0.1958 0.0827 0.0956 0.0939 0.0986 0.1008 0.0937 0.0971 0.1016 0.1320 0.1173 0.1307 0.1440 0.1453 0.1609 0.1493 0.1475 0.1527 0.1612 0.1615 0.1615
va: 1.2666 1.2423 2.1272 1.9991 2.0657 3.7258 3.8801 3.8327 3.9110 3.9007 3.8993 4.1290 4.2076 3.7936 3.6036 3.9008 3.9701 3.7053 3.8773 4.0224 3.6701 4.0057 3.8889 3.8764 3.8858 3.9055 1.0398 1.0337 1.0051 1.0009 1.0006 1.0197 0.9999 0.9988 1.0182 1.0088 0.9923 1.0124 1.0061 0.9876 1.0051 1.0081 1.0056 0.9878 0.9900 0.9893
dispcorr: -0.022665225 hartree
energy: -1958.458322525608
dipole: -11.57449 11.14564 -0.42885 -0.12074 -1.63475 -1.75549 -27.12453 26.22735 -0.89718
magnitude: 2.01757 au
magnitude: 5.12825 debye
