program: Orca
programVersion: 5.0.3
elementType: Cl Cl O O O C C C C C C C C C C C C C C C C C C C C C H H H H H H H H H H H H H H H H H H H H
charge: 0
multiplicity: 1
keywords: wb97x-d3
keywords: def2-TZVPP
keywords: def2/J RIJCOSX
keywords: DEFGRID2
keywords: scfconv7
keywords: smallprint printgap noloewdin
keywords: NOSOSCF
formula: C21H20Cl2O3
InChI: InChI=1/C21H20Cl2O3/c1-21(2)17(12-18(22)23)19(21)20(24)25-13-14-7-6-10-16(11-14)26-15-8-4-3-5-9-15/h3-12,17,19H,13H2,1-2H3
46 atoms
Cl 3.03619 -4.853964 0.884801
Cl 4.608014 -5.049716 -1.526024
O  -1.493151 -1.123427 -1.919696
O  -1.17226 -2.066359 0.081388
O  -1.148599 3.162226 0.50316
C  1.705489 -0.852476 -0.561919
C  1.71845 -2.356766 -0.513681
C  0.692473 -1.645938 -1.364467
C  2.753476 -0.115304 -1.35821
C  1.298758 -0.117331 0.691853
C  2.768946 -3.135927 -1.179162
C  -0.728801 -1.660609 -0.966961
C  3.38222 -4.195304 -0.667631
C  -2.856393 -0.85179 -1.586939
C  -2.968573 0.213453 -0.530939
C  -2.06293 1.266867 -0.501099
C  -3.984571 0.157786 0.415366
C  -2.149548 2.230335 0.492633
C  -4.078164 1.143715 1.387576
C  -3.157226 2.179472 1.447873
C  -1.351412 4.437361 0.962203
C  -2.496197 5.165948 0.664902
C  -0.312495 5.00987 1.682757
C  -2.593892 6.477943 1.106864
C  -0.419215 6.326376 2.106437
C  -1.560563 7.0646 1.825594
H  1.335117 -2.778471 0.408422
H  0.861285 -1.640491 -2.435698
H  2.987801 -0.596387 -2.306819
H  2.40808 0.895189 -1.581728
H  3.67853 -0.029898 -0.785491
H  2.181131 0.057711 1.30957
H  0.870143 0.857032 0.450471
H  0.580022 -0.661609 1.300503
H  3.075818 -2.829879 -2.172109
H  -3.305661 -0.519518 -2.522533
H  -3.372558 -1.762614 -1.277784
H  -1.26646 1.340395 -1.232013
H  -4.692847 -0.661171 0.403122
H  -4.864203 1.093962 2.129439
H  -3.224619 2.919472 2.234511
H  -3.302586 4.726488 0.09166
H  0.575451 4.429893 1.900226
H  -3.485169 7.046687 0.877015
H  0.395008 6.772584 2.662139
H  -1.643228 8.089591 2.161019
elementType: Cl O C H
totalener: -1958.43555255 hartree
nucrepener: 2467.69737669 hartree
electener: -4426.13292924 hartree
oneelecener: -7589.43271610 hartree
twoeener: 3163.29978686 hartree
cpcmener: -0.03158044 hartree
kineticenergy: 1952.56564135 hartree
xcener: -143.509957712617 hartree
chargesum: 0.0000000
charge: -0.058468 -0.063072 -0.291639 -0.474465 -0.336832 0.097860 0.027144 -0.067791 -0.267665 -0.270406 -0.203700 0.384114 0.037464 0.101925 0.068494 -0.346569 -0.237261 0.349044 -0.117912 -0.240101 0.298688 -0.208380 -0.257434 -0.148337 -0.125626 -0.187539 0.074959 0.101895 0.093484 0.098747 0.101503 0.107925 0.088585 0.096587 0.133566 0.123703 0.119435 0.138038 0.144391 0.162075 0.159443 0.159273 0.149925 0.162235 0.161324 0.161372
qa: -0.0585 -0.0631 -0.2916 -0.4745 -0.3368 0.0979 0.0271 -0.0678 -0.2677 -0.2704 -0.2037 0.3841 0.0375 0.1019 0.0685 -0.3466 -0.2373 0.3490 -0.1179 -0.2401 0.2987 -0.2084 -0.2574 -0.1483 -0.1256 -0.1875 0.0750 0.1019 0.0935 0.0987 0.1015 0.1079 0.0886 0.0966 0.1336 0.1237 0.1194 0.1380 0.1444 0.1621 0.1594 0.1593 0.1499 0.1622 0.1613 0.1614
va: 1.2673 1.2419 2.1118 2.0245 2.0479 3.7240 3.8922 3.8135 3.9027 3.8938 3.8939 4.2082 4.2038 3.7820 3.5781 4.0254 3.9881 3.6379 3.8887 3.9566 3.6748 3.9215 3.9969 3.8904 3.8798 3.8971 1.0513 1.0320 1.0048 1.0020 1.0009 1.0021 1.0076 1.0164 1.0166 0.9939 1.0077 1.0261 1.0027 0.9886 0.9960 0.9970 1.0055 0.9892 0.9886 0.9893
dispcorr: -0.023317758 hartree
energy: -1958.458870307451
dipole: -20.00624 19.29198 -0.71426 38.52739 -36.70037 1.82701 2.34647 -3.24971 -0.90324
magnitude: 2.15963 au
magnitude: 5.48934 debye
