program: Gaussian 09
title: 000071920
version: EM64L-G09RevD.01
frameworkgroup: C1[X(C8H20NO6P)]
method: RPBEPBE
basis: SDD
operation: Freq
keyword: #p
keyword: freq=noraman
keyword: PBEPBE/SDD
title: #p freq=noraman PBEPBE/SDD
converged: YES YES NO NO
title: Mulliken charges:
elementType: P O O O O O O N C C C C C C C C H H H H H H H H H H H H H H H H H H H H
charge: 1.344378 -0.490417 -0.602278 -0.501502 -0.645693 -0.718334 -0.495349 -0.104778 -0.356109 -0.561719 -0.600240 -0.594348 -0.316581 -0.074495 -0.300123 -0.303542 0.342973 0.235298 0.249696 0.246975 0.274365 0.354328 0.237579 0.232377 0.262355 0.359376 0.218241 0.234401 0.222318 0.216727 0.211825 0.261807 0.212905 0.198519 0.391634 0.357430
chargesum: 0.00000
title: Mulliken charges with hydrogens summed into heavy atoms:
elementType: P O O O O O O N C C C C C C C C
charge: 1.344378 -0.490417 -0.602278 -0.109868 -0.645693 -0.718334 -0.137919 -0.104778 0.222162 0.209318 0.224043 0.245623 0.140139 0.142233 0.173509 0.107882
polarizability: 1.58100379e+02 5.16810109e+00 1.38468943e+02 4.39024134e+00 -1.34283829e+00 1.18289936e+02
1716.lowfreq: -7.0790 -0.0007 0.0008 0.0010 8.9459 14.7923 36.7105 46.0305 66.0774
frequency: 36.5976 45.8980 65.9606 70.7492 80.9331 100.5029 113.8541 134.2557 146.0236 167.8135 196.8538 226.1186 240.9535 264.9836 286.4163 291.6771 309.0972 319.4027 329.2699 350.1740 355.3338 359.7531 381.6835 409.3524 434.3085 441.7627 462.3768 472.7338 503.5627 517.4236 545.3858 602.4425 704.8627 737.4448 754.9132 797.4792 825.2634 876.1574 883.4167 911.9573 924.0693 929.5988 952.4410 958.8401 988.1933 1002.6549 1016.9148 1056.9198 1064.8168 1068.6270 1088.1838 1093.8074 1116.0401 1133.8486 1155.6570 1188.2698 1204.4373 1220.3547 1249.5663 1255.8530 1277.7852 1291.3955 1316.6806 1331.9080 1341.7338 1347.9248 1381.0645 1399.5169 1405.1220 1426.6742 1432.6743 1443.8383 1448.9682 1454.1622 1471.5447 1472.9295 1480.2308 1482.3083 1487.6281 1497.1541 1502.1032 1521.4638 2907.4634 2973.0291 2974.3652 2979.6414 2983.4208 3013.0482 3020.8757 3028.2274 3049.5562 3060.6923 3064.7691 3076.3459 3093.8839 3098.3959 3120.8425 3130.2424 3143.5827 3147.5807 3315.3231 3338.7282
redmass: 3.7585 3.7347 3.7488 3.5988 4.8833 4.2428 4.5458 6.5015 3.8470 5.5506 5.2876 2.8549 1.3203 2.8259 3.2431 2.3134 2.0482 3.1024 1.2274 2.5522 4.0658 2.6982 2.5654 4.6284 2.2700 3.7885 3.4943 4.6213 3.1606 1.1818 6.6185 6.0887 3.1093 3.2541 2.1331 1.6799 2.0628 6.7512 4.0376 2.0261 2.7375 3.1194 3.4122 3.3694 4.5190 3.4300 3.4902 1.3528 1.4005 1.8452 1.9196 11.3538 1.3838 1.4241 1.1009 1.2185 1.3783 1.7560 1.3312 1.5800 1.1925 1.2359 1.3368 1.1930 1.2823 1.2288 1.2027 1.2058 1.3694 1.1451 1.1124 1.0804 1.0809 1.0707 1.0784 1.0593 1.0862 1.0554 1.0894 1.0678 1.0599 1.0521 1.0576 1.0451 1.0577 1.0612 1.0577 1.0594 1.0332 1.0864 1.1050 1.0992 1.1021 1.0843 1.1038 1.1063 1.1042 1.1041 1.1031 1.1036 1.0641 1.0632
irintensity: 2.9443 1.2097 2.6477 2.9580 1.7983 2.6896 6.6845 11.9513 9.1206 14.4147 1.3602 10.2259 1.9713 7.1310 4.0372 1.8871 12.7935 5.0702 0.8035 5.0662 5.5482 17.2378 4.3503 17.7566 3.1263 8.7990 25.2322 105.2012 1.0259 108.9192 210.2120 165.4342 3.9402 87.0718 8.1263 79.8117 8.3047 90.2805 41.0319 15.5174 28.1607 32.8432 94.2126 62.9067 107.1568 30.8920 3.2065 1.8519 12.5596 5.2118 20.8814 184.8051 1.1257 0.2083 24.4121 20.6002 5.3360 1.7454 16.3132 1.1750 2.4110 9.9217 3.3484 16.3242 3.0535 2.6996 0.9874 55.5630 74.0750 5.8312 25.5322 1.4019 18.6000 0.3189 9.5190 0.9590 14.4308 2.4639 36.0921 41.1981 57.5189 56.9757 168.5128 20.7087 140.3312 54.6310 20.5963 29.2477 20.3933 75.4055 16.5949 27.0118 38.8341 10.4423 12.1547 11.1644 9.1046 13.9923 6.4628 3.4557 128.5214 78.3038
temp: 298.150 k
press: 1.00000 atm
elementType: 15 8 8 8 8 8 8 7 6 6 6 6 6 6 6 6 1 1 1 1 1 1 1 1 1 1 1 1 1 1 1 1 1 1 1 1
symmnumber: 1
zpe: 778524.1 jmol-1
zpe.correction: 0.296524 hartree
zpe.thermalcorrener: 0.315795 hartree
zpe.thermalcorrenthalpy: 0.316739 hartree
zpe.thermalcorrgfe: 0.249447 hartree
zpe.sumelectzpe: -1162.755299 hartree
zpe.sumelectthermal: -1162.736029 hartree
zpe.sumelectthermalent: -1162.735084 hartree
zpe.sumelectthermalfe: -1162.802377 hartree
dipole: 10.4267 8.5907 -2.5719
dipole: 13.7525
quadrupole: -81.9702 -131.1625 -106.4966
quadrupole: -6.7056 4.6236 -0.1776
quadrupole: 24.5728 -24.6194 0.0465 -6.7056 4.6236 -0.1776
hfenergy: -1163.0518235 hartree
pointgroup: C01 [X(C8H20N1O6P1)]
dipole: 3.7464516 3.4175479 -1.8866962 debye
polarizability: 155.4195832|9.6034948|137.7118664|5.1369392|-6.4329423|121.7278073 unknown
InChI: InChI=1S/C8H20NO6P/c1-9(2,3)4-5-14-16(12,13)15-7-8(11)6-10/h8,10-11H,4-7H2,1-3H3
charge 0 multiplicity 1
36 atoms
P  -0.480468 -1.900548 1.06475
O  0.60278 -2.127112 -0.379498
O  -1.169021 -0.303149 0.530517
O  -2.723856 1.757993 0.617444
O  -1.616748 -3.011662 1.009809
O  0.474921 -1.486473 2.29456
O  -0.639158 2.602121 -0.749853
N  2.522696 1.02362 0.231137
C  1.816504 0.002531 -0.702703
C  3.954617 0.600368 0.511434
C  2.52008 2.376522 -0.48045
C  1.749625 1.160735 1.548899
C  1.905854 -1.485324 -0.260337
C  -2.638873 1.125342 -0.717163
C  -2.185535 -0.339608 -0.536101
C  -1.696555 2.01522 -1.587806
H  0.756982 0.309511 -0.712114
H  2.261237 0.162831 -1.701206
H  4.466262 0.399208 -0.44323
H  4.467851 1.414302 1.047399
H  3.953445 -0.30478 1.134781
H  1.476467 2.616931 -0.752232
H  2.922892 3.137486 0.207569
H  3.154557 2.310346 -1.379376
H  0.789406 1.64343 1.314672
H  1.525456 0.161531 1.979392
H  2.3476 1.783991 2.233892
H  2.575307 -2.049326 -0.931985
H  2.27077 -1.580207 0.78281
H  -3.649514 1.133586 -1.165243
H  -1.762513 -0.749874 -1.474032
H  -3.025621 -0.982908 -0.214027
H  -2.281243 2.831697 -2.057049
H  -1.206887 1.423544 -2.380906
H  -2.227346 1.120773 1.21717
H  -1.122672 2.76305 0.116374
