program: Orca
programVersion: 5.0.2
elementType: O O O C C C C C C C C C C C C C C C C C C C C C C C H H H H H H H H H H H H H H H H H H H H H H H H H H
charge: 0
multiplicity: 1
keywords: wb97x-d3
keywords: def2-TZVPP
keywords: def2/J RIJCOSX
keywords: DEFGRID2
keywords: scfconv7
keywords: smallprint printgap noloewdin
keywords: NOSOSCF
formula: C23H26O3
InChI: InChI=1/C23H26O3/c1-16(2)13-20-21(23(20,3)4)22(24)25-15-17-9-8-12-19(14-17)26-18-10-6-5-7-11-18/h5-14,20-21H,15H2,1-4H3
52 atoms
O  0.336782 -1.917332 -1.48536
O  0.062446 -3.181587 0.340455
O  2.002765 2.182066 1.041958
C  -2.987643 -2.941821 -0.397737
C  -2.642886 -1.952604 0.661174
C  -1.803485 -2.013042 -0.602401
C  -4.175911 -2.666916 -1.288529
C  -2.772408 -4.410556 -0.127017
C  -3.481128 -0.758756 0.941392
C  -0.400407 -2.459151 -0.500976
C  -3.013735 0.449964 1.258035
C  -3.937968 1.597075 1.535408
C  -1.554373 0.772501 1.356195
C  1.74361 -2.087037 -1.394873
C  2.352796 -1.19752 -0.343867
C  1.879442 0.098768 -0.171784
C  3.40495 -1.654865 0.437603
C  2.464107 0.926493 0.776849
C  3.986406 -0.817617 1.377475
C  3.524647 0.475814 1.550817
C  1.526025 2.982884 0.048523
C  2.104521 3.040471 -1.214098
C  0.453971 3.805928 0.366332
C  1.590498 3.916403 -2.15772
C  -0.042872 4.683842 -0.583993
C  0.516402 4.739278 -1.851886
H  -2.143077 -2.381949 1.526545
H  -1.966353 -1.213557 -1.316072
H  -4.064995 -3.181635 -2.244309
H  -4.304481 -1.604787 -1.496875
H  -5.096386 -3.02752 -0.824532
H  -2.582028 -4.954536 -1.05429
H  -3.671532 -4.834823 0.323883
H  -1.94112 -4.597946 0.547652
H  -4.557567 -0.902649 0.906519
H  -4.98538 1.315892 1.43259
H  -3.743419 2.428171 0.852658
H  -3.791664 1.984314 2.54671
H  -1.26935 1.507179 0.598033
H  -0.909602 -0.095592 1.241296
H  -1.323791 1.224502 2.324011
H  2.119645 -1.817103 -2.383201
H  2.006385 -3.130792 -1.210399
H  1.047861 0.457128 -0.765862
H  3.759862 -2.671308 0.325001
H  4.803439 -1.177812 1.988297
H  3.966881 1.133347 2.287328
H  2.950305 2.41195 -1.46056
H  0.021382 3.756207 1.357015
H  2.042368 3.957428 -3.140028
H  -0.877151 5.324385 -0.329995
H  0.122811 5.421068 -2.59334
totalener: -1117.84621067 hartree
nucrepener: 2316.43014950 hartree
electener: -3434.27636017 hartree
oneelecener: -6121.56846353 hartree
twoeener: 2687.29210335 hartree
kineticenergy: 1112.85516359 hartree
xcener: -110.234118682321 hartree
chargesum: -0.0000000
charge: -0.274123 -0.375411 -0.304453 0.136824 -0.015710 -0.097475 -0.273335 -0.259288 -0.248254 0.302057 0.027442 -0.218106 -0.254290 0.071305 0.075402 -0.303639 -0.179282 0.318482 -0.072652 -0.243065 0.285666 -0.179280 -0.265954 -0.109772 -0.074355 -0.151144 0.107378 0.085718 0.090569 0.085094 0.090354 0.084064 0.081874 0.102130 0.092668 0.079383 0.084233 0.086869 0.087063 0.091462 0.093555 0.103422 0.100142 0.137797 0.105645 0.124081 0.124788 0.131418 0.135816 0.126576 0.125444 0.124870
qa: -0.2741 -0.3754 -0.3045 0.1368 -0.0157 -0.0975 -0.2733 -0.2593 -0.2483 0.3021 0.0274 -0.2181 -0.2543 0.0713 0.0754 -0.3036 -0.1793 0.3185 -0.0727 -0.2431 0.2857 -0.1793 -0.2660 -0.1098 -0.0744 -0.1511 0.1074 0.0857 0.0906 0.0851 0.0904 0.0841 0.0819 0.1021 0.0927 0.0794 0.0842 0.0869 0.0871 0.0915 0.0936 0.1034 0.1001 0.1378 0.1056 0.1241 0.1248 0.1314 0.1358 0.1266 0.1254 0.1249
va: 2.1064 2.1212 2.0899 3.7373 3.8144 3.8043 3.9093 3.9014 3.9125 4.2300 3.7104 3.9403 3.9498 3.8695 3.7004 3.9458 4.0425 3.6913 3.9306 4.0824 3.7580 3.9490 4.0015 3.9442 3.9180 3.9758 1.0245 1.0316 1.0065 1.0050 1.0014 1.0023 1.0020 1.0221 1.0093 1.0103 0.9990 0.9991 0.9985 1.0144 1.0031 0.9870 1.0131 1.0128 1.0120 0.9992 1.0137 1.0053 1.0077 0.9995 0.9986 1.0007
dispcorr: -0.027294674 hartree
energy: -1117.873505344594
dipole: -22.74948 22.57986 -0.16963 -4.63609 5.07748 0.44138 -0.10211 -0.53082 -0.63293
magnitude: 0.79006 au
magnitude: 2.00816 debye
