program: Orca
programVersion: 5.0.2
elementType: O O O C C C C C C C C C C C C C C C C C C C C C C C H H H H H H H H H H H H H H H H H H H H H H H H H H
charge: 0
multiplicity: 1
keywords: wb97x-d3
keywords: def2-TZVPP
keywords: def2/J RIJCOSX
keywords: DEFGRID2
keywords: scfconv7
keywords: smallprint printgap noloewdin
keywords: NOSOSCF
formula: C23H26O3
InChI: InChI=1/C23H26O3/c1-16(2)13-20-21(23(20,3)4)22(24)25-15-17-9-8-12-19(14-17)26-18-10-6-5-7-11-18/h5-14,20-21H,15H2,1-4H3
52 atoms
O  0.417146 -2.52109 -0.044278
O  -0.48877 -1.259005 1.572872
O  2.890192 2.278961 -0.072286
C  -3.170382 -2.320887 0.319527
C  -2.900668 -0.921342 -0.11499
C  -1.818336 -1.970099 -0.279594
C  -4.041541 -3.199217 -0.547115
C  -3.308785 -2.613878 1.793211
C  -3.547747 -0.322093 -1.30966
C  -0.591028 -1.862667 0.535011
C  -2.965002 0.539308 -2.14466
C  -3.69576 1.097375 -3.32791
C  -1.55163 1.010464 -1.982977
C  1.7094 -2.464512 0.564983
C  2.54783 -1.380198 -0.051175
C  2.307508 -0.045676 0.273524
C  3.547428 -1.701832 -0.956726
C  3.065201 0.953475 -0.319657
C  4.308038 -0.693991 -1.535559
C  4.072418 0.631025 -1.225545
C  1.933532 2.669802 0.827164
C  0.693172 3.074508 0.360735
C  2.222972 2.687458 2.183079
C  -0.267328 3.504096 1.264306
C  1.255202 3.117051 3.078148
C  0.009024 3.523321 2.623077
H  -2.702864 -0.231469 0.702317
H  -1.655657 -2.337531 -1.286327
H  -5.096239 -3.063779 -0.298114
H  -3.798706 -4.251413 -0.390162
H  -3.922187 -2.987184 -1.60965
H  -4.348376 -2.47563 2.096853
H  -2.693034 -1.966094 2.411902
H  -3.037272 -3.648328 2.012837
H  -4.581913 -0.598847 -1.494789
H  -3.760034 2.186991 -3.274197
H  -4.708867 0.705125 -3.407683
H  -3.170503 0.862975 -4.257329
H  -0.922734 0.646686 -2.799804
H  -1.096621 0.69369 -1.046978
H  -1.507326 2.102028 -2.022693
H  2.159308 -3.439987 0.380096
H  1.618768 -2.329206 1.643379
H  1.534786 0.197472 0.990974
H  3.735094 -2.737022 -1.21267
H  5.091741 -0.944453 -2.238227
H  4.659045 1.421896 -1.674209
H  0.488366 3.055744 -0.701746
H  3.197129 2.368014 2.530459
H  -1.237051 3.819709 0.902696
H  1.476135 3.130565 4.137117
H  -0.743665 3.854213 3.325677
totalener: -1117.84653134 hartree
nucrepener: 2315.54112935 hartree
electener: -3433.38766069 hartree
oneelecener: -6120.01275639 hartree
twoeener: 2686.62509570 hartree
kineticenergy: 1112.85694996 hartree
xcener: -110.231620530731 hartree
chargesum: -0.0000000
charge: -0.259467 -0.406665 -0.299449 0.138481 -0.021577 -0.112562 -0.276489 -0.262456 -0.245420 0.352715 0.003403 -0.211743 -0.217636 0.050412 -0.017971 -0.205607 -0.200077 0.278437 -0.069596 -0.227778 0.214720 -0.183544 -0.142692 -0.114827 -0.122145 -0.102209 0.102619 0.085343 0.089872 0.091703 0.084897 0.083330 0.102015 0.084390 0.093662 0.086079 0.078673 0.085721 0.097781 0.071637 0.079285 0.093693 0.116110 0.157692 0.104074 0.122085 0.122050 0.132239 0.124619 0.121977 0.125500 0.124695
qa: -0.2595 -0.4067 -0.2994 0.1385 -0.0216 -0.1126 -0.2765 -0.2625 -0.2454 0.3527 0.0034 -0.2117 -0.2176 0.0504 -0.0180 -0.2056 -0.2001 0.2784 -0.0696 -0.2278 0.2147 -0.1835 -0.1427 -0.1148 -0.1221 -0.1022 0.1026 0.0853 0.0899 0.0917 0.0849 0.0833 0.1020 0.0844 0.0937 0.0861 0.0787 0.0857 0.0978 0.0716 0.0793 0.0937 0.1161 0.1577 0.1041 0.1221 0.1220 0.1322 0.1246 0.1220 0.1255 0.1247
va: 2.1326 2.0817 2.1152 3.7192 3.8242 3.8390 3.9114 3.9024 3.8971 4.1813 3.7430 3.9417 3.9494 3.8567 3.7975 3.8613 4.0354 3.8215 3.9426 4.0533 3.8548 4.0034 3.9893 3.9309 3.9548 3.9469 1.0289 1.0335 1.0012 1.0063 1.0044 1.0021 1.0211 1.0020 1.0097 0.9990 1.0096 0.9984 1.0014 1.0087 1.0012 0.9996 1.0150 1.0171 1.0131 0.9991 1.0156 1.0006 1.0076 1.0020 1.0001 0.9999
dispcorr: -0.026455574 hartree
energy: -1117.872986916607
dipole: -24.66343 24.34593 -0.31750 -6.29865 6.03533 -0.26331 -7.33683 7.02915 -0.30769
magnitude: 0.51460 au
magnitude: 1.30800 debye
