program: Orca
programVersion: 5.0.2
elementType: O O O C C C C C C C C C C C C C C C C C C C C C C C H H H H H H H H H H H H H H H H H H H H H H H H H H
charge: 0
multiplicity: 1
keywords: wb97x-d3
keywords: def2-TZVPP
keywords: def2/J RIJCOSX
keywords: DEFGRID2
keywords: scfconv7
keywords: smallprint printgap noloewdin
keywords: NOSOSCF
formula: C23H26O3
InChI: InChI=1/C23H26O3/c1-16(2)13-20-21(23(20,3)4)22(24)25-15-17-9-8-12-19(14-17)26-18-10-6-5-7-11-18/h5-14,20-21H,15H2,1-4H3
52 atoms
O  0.614161 -2.765041 0.063154
O  -0.18262 -1.131296 1.370768
O  3.266225 2.1732 0.124949
C  -2.942458 -2.413167 0.60119
C  -2.69394 -1.169546 -0.196249
C  -1.636891 -2.257891 -0.154894
C  -3.889854 -3.465702 0.074011
C  -2.975894 -2.30053 2.106282
C  -3.379842 -0.865513 -1.4636
C  -0.354733 -1.96755 0.521726
C  -3.766194 0.337368 -1.896448
C  -4.445555 0.49161 -3.224756
C  -3.571817 1.621426 -1.147627
C  1.94147 -2.540271 0.547337
C  2.601967 -1.414908 -0.197143
C  2.633149 -0.137658 0.34606
C  3.152739 -1.641568 -1.45483
C  3.192644 0.908312 -0.376528
C  3.727844 -0.596839 -2.158936
C  3.74273 0.684207 -1.629548
C  2.196158 2.720352 0.771643
C  2.476502 3.619414 1.791434
C  0.880482 2.450622 0.414017
C  1.43621 4.253573 2.451416
C  -0.149252 3.086046 1.09027
C  0.118703 3.988097 2.108693
H  -2.43454 -0.31208 0.414183
H  -1.54387 -2.875936 -1.040949
H  -3.810232 -3.614806 -1.001923
H  -4.923812 -3.19434 0.293572
H  -3.690136 -4.427205 0.549833
H  -2.338625 -1.506379 2.486258
H  -2.660556 -3.235938 2.573094
H  -3.996752 -2.097353 2.434901
H  -3.575915 -1.712049 -2.114693
H  -4.554312 -0.459797 -3.744049
H  -3.885289 1.16634 -3.877003
H  -5.441778 0.926428 -3.110182
H  -2.940724 2.307755 -1.71815
H  -3.116937 1.491951 -0.16806
H  -4.527825 2.129548 -1.000379
H  2.463946 -3.479506 0.367212
H  1.934908 -2.354906 1.6224
H  2.202237 0.042731 1.322432
H  3.133328 -2.636279 -1.882497
H  4.160779 -0.775065 -3.134321
H  4.180064 1.508643 -2.177072
H  3.506452 3.818114 2.057207
H  0.653073 1.749642 -0.378152
H  1.6602 4.954392 3.244782
H  -1.172507 2.87073 0.811291
H  -0.691412 4.479185 2.630366
totalener: -1117.84798814 hartree
nucrepener: 2282.43124759 hartree
electener: -3400.27923573 hartree
oneelecener: -6053.70033978 hartree
twoeener: 2653.42110405 hartree
kineticenergy: 1112.85852828 hartree
xcener: -110.233299228972 hartree
chargesum: -0.0000000
charge: -0.262709 -0.406432 -0.301622 0.073655 0.043246 -0.070434 -0.253712 -0.255417 -0.181064 0.357852 -0.047288 -0.203870 -0.242209 0.045756 -0.007080 -0.140326 -0.186845 0.221818 -0.087734 -0.209380 0.272489 -0.230143 -0.169592 -0.074021 -0.073696 -0.178079 0.084214 0.071372 0.072329 0.094017 0.090831 0.100876 0.083948 0.084921 0.071103 0.076018 0.084674 0.084060 0.091674 0.070288 0.088814 0.109771 0.108498 0.136979 0.108978 0.124364 0.124932 0.121948 0.122259 0.121998 0.118108 0.119867
qa: -0.2627 -0.4064 -0.3016 0.0737 0.0432 -0.0704 -0.2537 -0.2554 -0.1811 0.3579 -0.0473 -0.2039 -0.2422 0.0458 -0.0071 -0.1403 -0.1868 0.2218 -0.0877 -0.2094 0.2725 -0.2301 -0.1696 -0.0740 -0.0737 -0.1781 0.0842 0.0714 0.0723 0.0940 0.0908 0.1009 0.0839 0.0849 0.0711 0.0760 0.0847 0.0841 0.0917 0.0703 0.0888 0.1098 0.1085 0.1370 0.1090 0.1244 0.1249 0.1219 0.1223 0.1220 0.1181 0.1199
va: 2.1354 2.0817 2.1109 3.7550 3.7861 3.8281 3.9189 3.9091 3.9074 4.2131 3.8192 3.9356 3.9407 3.8620 3.6738 3.8896 4.0250 3.8560 3.9334 4.0540 3.8070 4.0446 3.9343 3.9240 3.9206 4.0117 1.0285 1.0366 1.0105 1.0030 1.0042 1.0226 1.0027 1.0007 1.0220 1.0121 0.9981 0.9980 0.9971 1.0167 1.0009 0.9942 1.0117 1.0226 1.0120 0.9991 1.0124 1.0153 1.0085 0.9988 1.0001 1.0033
dispcorr: -0.024892348 hartree
energy: -1117.872880484200
dipole: -29.90248 29.40310 -0.49938 -5.48666 4.97628 -0.51038 -4.75457 4.34474 -0.40983
magnitude: 0.82330 au
magnitude: 2.09267 debye
