program: Orca
programVersion: 5.0.2
elementType: O O O C C C C C C C C C C C C C C C C C C C C C C C H H H H H H H H H H H H H H H H H H H H H H H H H H
charge: 0
multiplicity: 1
keywords: wb97x-d3
keywords: def2-TZVPP
keywords: def2/J RIJCOSX
keywords: DEFGRID2
keywords: scfconv7
keywords: smallprint printgap noloewdin
keywords: NOSOSCF
formula: C23H26O3
InChI: InChI=1/C23H26O3/c1-16(2)13-20-21(23(20,3)4)22(24)25-15-17-9-8-12-19(14-17)26-18-10-6-5-7-11-18/h5-14,20-21H,15H2,1-4H3
52 atoms
O  0.287776 -1.349111 1.816431
O  -0.184805 -2.563313 -0.001482
O  3.719463 1.927241 -0.245473
C  -2.282973 -0.266764 -0.444557
C  -2.975897 -1.485501 0.089489
C  -1.75768 -0.948005 0.805719
C  -2.906192 1.093381 -0.241195
C  -1.540147 -0.384015 -1.75285
C  -4.293981 -1.424727 0.751839
C  -0.496425 -1.718316 0.79428
C  -5.379763 -2.132804 0.433212
C  -6.656654 -1.972069 1.203373
C  -5.451268 -3.123391 -0.688837
C  1.581075 -1.938636 1.878276
C  2.522126 -1.349068 0.864693
C  2.649977 0.03093 0.762892
C  3.291503 -2.170363 0.051564
C  3.542723 0.575691 -0.148554
C  4.196585 -1.617084 -0.840952
C  4.323291 -0.241737 -0.952176
C  2.634844 2.732614 -0.42505
C  2.70228 4.010607 0.113966
C  1.519132 2.33645 -1.153302
C  1.650823 4.892108 -0.079277
C  0.473277 3.228626 -1.33444
C  0.52916 4.506877 -0.799363
H  -2.776602 -2.38608 -0.481227
H  -1.938774 -0.407023 1.728189
H  -2.142515 1.872025 -0.288684
H  -3.410307 1.190548 0.719197
H  -3.644452 1.296015 -1.019166
H  -0.704095 0.317801 -1.789677
H  -2.212404 -0.138245 -2.577097
H  -1.143796 -1.380181 -1.931208
H  -4.378415 -0.732417 1.584734
H  -7.477458 -1.673779 0.546153
H  -6.570893 -1.225248 1.99175
H  -6.957307 -2.915167 1.66691
H  -4.505973 -3.267709 -1.205938
H  -6.185432 -2.803573 -1.432219
H  -5.78393 -4.098029 -0.324634
H  1.523001 -3.022917 1.763061
H  1.931554 -1.726901 2.889391
H  2.05504 0.683958 1.390638
H  3.175644 -3.244841 0.110681
H  4.794302 -2.261127 -1.47212
H  5.017226 0.201611 -1.653901
H  3.578142 4.305477 0.67684
H  1.46693 1.344062 -1.582494
H  1.708912 5.886708 0.342925
H  -0.390033 2.918392 -1.909208
H  -0.290432 5.197034 -0.945812
totalener: -1117.84770314 hartree
nucrepener: 2270.37260396 hartree
electener: -3388.22030710 hartree
oneelecener: -6029.34158478 hartree
twoeener: 2641.12127768 hartree
kineticenergy: 1112.86022183 hartree
xcener: -110.233793917216 hartree
chargesum: -0.0000000
charge: -0.272401 -0.380649 -0.302173 0.118735 0.034023 -0.099041 -0.246778 -0.255895 -0.187892 0.335492 -0.050946 -0.204093 -0.235637 0.065836 0.033974 -0.201906 -0.142710 0.209799 -0.093283 -0.197539 0.230579 -0.209893 -0.130262 -0.087560 -0.150476 -0.151945 0.089594 0.070799 0.087475 0.071367 0.091456 0.052557 0.090819 0.106480 0.072838 0.082758 0.076430 0.085671 0.083251 0.085931 0.085251 0.100357 0.109074 0.125283 0.106965 0.124195 0.126614 0.124690 0.138723 0.123922 0.136136 0.124001
qa: -0.2724 -0.3806 -0.3022 0.1187 0.0340 -0.0990 -0.2468 -0.2559 -0.1879 0.3355 -0.0509 -0.2041 -0.2356 0.0658 0.0340 -0.2019 -0.1427 0.2098 -0.0933 -0.1975 0.2306 -0.2099 -0.1303 -0.0876 -0.1505 -0.1519 0.0896 0.0708 0.0875 0.0714 0.0915 0.0526 0.0908 0.1065 0.0728 0.0828 0.0764 0.0857 0.0833 0.0859 0.0853 0.1004 0.1091 0.1253 0.1070 0.1242 0.1266 0.1247 0.1387 0.1239 0.1361 0.1240
va: 2.1199 2.1238 2.1023 3.6910 3.8003 3.8884 3.9147 3.9075 3.8975 4.2443 3.8181 3.9357 3.9465 3.8656 3.6833 3.9532 3.9993 3.8336 3.9397 4.0410 3.8534 4.0319 3.8821 3.9460 3.9418 3.9850 1.0357 1.0400 1.0104 1.0137 1.0030 1.0178 1.0017 1.0255 1.0209 0.9983 1.0122 0.9982 1.0153 0.9993 0.9994 1.0119 0.9893 1.0209 1.0140 0.9999 1.0112 1.0140 0.9996 0.9982 0.9918 1.0018
dispcorr: -0.025719559 hartree
energy: -1117.873422703690
dipole: -33.03230 32.48904 -0.54326 -5.28914 5.47545 0.18631 -3.57677 3.79844 0.22166
magnitude: 0.61561 au
magnitude: 1.56476 debye
