program: Orca
programVersion: 5.0.2
elementType: O O O C C C C C C C C C C C C C C C C C C C C C C C H H H H H H H H H H H H H H H H H H H H H H H H H H
charge: 0
multiplicity: 1
keywords: wb97x-d3
keywords: def2-TZVPP
keywords: def2/J RIJCOSX
keywords: DEFGRID2
keywords: scfconv7
keywords: smallprint printgap noloewdin
keywords: NOSOSCF
formula: C23H26O3
InChI: InChI=1/C23H26O3/c1-16(2)13-20-21(23(20,3)4)22(24)25-15-17-9-8-12-19(14-17)26-18-10-6-5-7-11-18/h5-14,20-21H,15H2,1-4H3
52 atoms
O  0.249751 -2.696325 0.402578
O  -0.43938 -0.791102 1.350396
O  3.233718 2.220706 -0.254079
C  -3.292789 -2.060868 1.004287
C  -3.017038 -1.117174 -0.115311
C  -2.004712 -2.199317 0.212325
C  -4.292121 -3.172589 0.786903
C  -3.275755 -1.541098 2.420792
C  -3.768196 -1.155136 -1.396126
C  -0.684615 -1.795954 0.734273
C  -3.239648 -0.965626 -2.606215
C  -4.089782 -1.000108 -3.840205
C  -1.783563 -0.704535 -2.843923
C  1.607489 -2.328429 0.640109
C  2.039678 -1.241709 -0.304278
C  2.463944 -0.017986 0.187923
C  1.970642 -1.446421 -1.679476
C  2.79626 1.006639 -0.689345
C  2.321131 -0.426143 -2.547424
C  2.724844 0.807752 -2.059364
C  2.608765 2.869686 0.770661
C  1.278103 2.662269 1.115554
C  3.369917 3.813421 1.44969
C  0.724573 3.40025 2.151722
C  2.798035 4.549428 2.4740
C  1.473802 4.345258 2.835048
H  -2.701506 -0.126961 0.206499
H  -1.975239 -3.041934 -0.468894
H  -4.279187 -3.551252 -0.235516
H  -5.306187 -2.826938 0.999233
H  -4.083497 -4.010867 1.454227
H  -2.587021 -0.711331 2.557386
H  -2.997053 -2.328435 3.123988
H  -4.274608 -1.195449 2.694476
H  -4.839527 -1.323115 -1.323958
H  -5.13545 -1.205404 -3.613163
H  -3.739919 -1.766684 -4.536759
H  -4.042018 -0.048742 -4.376022
H  -1.20411 -0.603767 -1.929421
H  -1.648344 0.213442 -3.421323
H  -1.337043 -1.50884 -3.435461
H  2.173517 -3.244532 0.470073
H  1.755798 -2.026064 1.678687
H  2.5027 0.145465 1.257601
H  1.63592 -2.398778 -2.071272
H  2.268386 -0.583915 -3.616587
H  2.983833 1.615572 -2.730947
H  0.671765 1.927935 0.602268
H  4.403397 3.965707 1.166777
H  -0.308877 3.227001 2.421259
H  3.396918 5.28378 2.996636
H  1.031915 4.916219 3.640443
totalener: -1117.84638629 hartree
nucrepener: 2289.82903386 hartree
electener: -3407.67542014 hartree
oneelecener: -6068.52496622 hartree
twoeener: 2660.84954608 hartree
kineticenergy: 1112.85483612 hartree
xcener: -110.232546464296 hartree
chargesum: -0.0000000
charge: -0.263498 -0.398695 -0.299333 0.134456 -0.025455 -0.093250 -0.273168 -0.258123 -0.243698 0.323100 0.002851 -0.212453 -0.219347 0.066924 0.047748 -0.179518 -0.259198 0.258596 -0.062384 -0.212570 0.285125 -0.176887 -0.233655 -0.119370 -0.083302 -0.153588 0.104516 0.086692 0.084942 0.090031 0.091794 0.099957 0.084627 0.082688 0.092976 0.078622 0.084120 0.087761 0.078873 0.090699 0.084175 0.112968 0.099763 0.124073 0.114108 0.123630 0.124494 0.134336 0.121378 0.126499 0.122556 0.122417
qa: -0.2635 -0.3987 -0.2993 0.1345 -0.0255 -0.0933 -0.2732 -0.2581 -0.2437 0.3231 0.0029 -0.2125 -0.2193 0.0669 0.0477 -0.1795 -0.2592 0.2586 -0.0624 -0.2126 0.2851 -0.1769 -0.2337 -0.1194 -0.0833 -0.1536 0.1045 0.0867 0.0849 0.0900 0.0918 0.1000 0.0846 0.0827 0.0930 0.0786 0.0841 0.0878 0.0789 0.0907 0.0842 0.1130 0.0998 0.1241 0.1141 0.1236 0.1245 0.1343 0.1214 0.1265 0.1226 0.1224
va: 2.1206 2.0916 2.1155 3.7304 3.8246 3.8014 3.9090 3.9020 3.8951 4.2081 3.7533 3.9407 3.9426 3.8541 3.6177 3.9512 3.9858 3.8273 3.8749 4.0612 3.7853 3.9239 4.0391 3.9586 3.9299 3.9650 1.0251 1.0311 1.0050 1.0017 1.0063 1.0220 1.0023 1.0018 1.0103 1.0098 0.9989 0.9988 1.0106 1.0033 1.0012 0.9902 1.0117 1.0144 1.0177 0.9990 1.0123 1.0113 1.0160 1.0000 0.9989 1.0009
dispcorr: -0.026271197 hartree
energy: -1117.872657485630
dipole: -26.27094 25.82479 -0.44615 -10.24368 9.59768 -0.64600 -6.19498 5.80099 -0.39399
magnitude: 0.87840 au
magnitude: 2.23272 debye
