program: Orca
programVersion: 5.0.2
elementType: O O O C C C C C C C C C C C C C C C C C C C C C C C H H H H H H H H H H H H H H H H H H H H H H H H H H
charge: 0
multiplicity: 1
keywords: wb97x-d3
keywords: def2-TZVPP
keywords: def2/J RIJCOSX
keywords: DEFGRID2
keywords: scfconv7
keywords: smallprint printgap noloewdin
keywords: NOSOSCF
formula: C23H26O3
InChI: InChI=1/C23H26O3/c1-16(2)13-20-21(23(20,3)4)22(24)25-15-17-9-8-12-19(14-17)26-18-10-6-5-7-11-18/h5-14,20-21H,15H2,1-4H3
52 atoms
O  0.318741 -2.298374 -1.196035
O  -0.434888 -0.192854 -1.30637
O  3.796985 1.813921 0.458922
C  -2.328684 -1.156583 0.981636
C  -3.073166 -1.181901 -0.319597
C  -1.737865 -1.876775 -0.218214
C  -2.813145 -2.040656 2.105037
C  -1.75019 0.151011 1.463544
C  -4.30197 -1.990419 -0.508348
C  -0.575719 -1.335544 -0.954799
C  -5.548123 -1.51684 -0.473565
C  -6.729023 -2.413863 -0.690407
C  -5.878881 -0.077802 -0.22066
C  1.546824 -1.920163 -1.823494
C  2.521053 -1.377781 -0.816548
C  2.694406 -0.007375 -0.674357
C  3.232032 -2.251298 0.000301
C  3.56168 0.482714 0.29442
C  4.10831 -1.754305 0.950864
C  4.271579 -0.387279 1.109127
C  2.7849 2.723404 0.357985
C  3.119511 3.97369 -0.144038
C  1.48789 2.460744 0.781973
C  2.152722 4.963235 -0.220019
C  0.529119 3.45746 0.689079
C  0.852289 4.710552 0.190938
H  -3.034252 -0.247249 -0.87153
H  -1.761186 -2.959508 -0.154556
H  -2.005481 -2.24519 2.809805
H  -3.198382 -2.995963 1.751038
H  -3.619606 -1.550129 2.653302
H  -1.465876 0.813411 0.649385
H  -0.868439 -0.017487 2.086034
H  -2.488647 0.670106 2.078048
H  -4.16414 -3.052464 -0.690629
H  -6.432739 -3.449261 -0.854092
H  -7.313925 -2.092697 -1.55592
H  -7.404667 -2.389046 0.168214
H  -6.426775 0.350294 -1.063585
H  -5.000329 0.539057 -0.044552
H  -6.529286 0.019023 0.651933
H  1.367298 -1.204487 -2.627067
H  1.926063 -2.841046 -2.266097
H  2.139005 0.671963 -1.307951
H  3.101618 -3.320739 -0.109308
H  4.665281 -2.433932 1.582155
H  4.947167 0.011062 1.854543
H  4.134821 4.162977 -0.466852
H  1.218284 1.489442 1.174902
H  2.419238 5.936258 -0.611185
H  -0.481046 3.246061 1.014462
H  0.097763 5.482247 0.122174
totalener: -1117.84754678 hartree
nucrepener: 2259.31592342 hartree
electener: -3377.16347019 hartree
oneelecener: -6007.45123855 hartree
twoeener: 2630.28776836 hartree
kineticenergy: 1112.86037507 hartree
xcener: -110.232761857303 hartree
chargesum: -0.0000000
charge: -0.263246 -0.398934 -0.300046 0.159811 -0.021913 -0.137676 -0.236361 -0.308964 -0.191019 0.374814 -0.029259 -0.211803 -0.234931 0.042074 -0.005958 -0.154432 -0.189508 0.242576 -0.085263 -0.216591 0.263321 -0.222364 -0.162272 -0.085715 -0.093467 -0.157913 0.103076 0.074554 0.092982 0.077349 0.086605 0.092091 0.093847 0.089733 0.085816 0.078128 0.086818 0.083584 0.091182 0.080210 0.084506 0.109752 0.108197 0.135812 0.109032 0.123881 0.124905 0.122237 0.127562 0.122539 0.118941 0.121698
qa: -0.2632 -0.3989 -0.3000 0.1598 -0.0219 -0.1377 -0.2364 -0.3090 -0.1910 0.3748 -0.0293 -0.2118 -0.2349 0.0421 -0.0060 -0.1544 -0.1895 0.2426 -0.0853 -0.2166 0.2633 -0.2224 -0.1623 -0.0857 -0.0935 -0.1579 0.1031 0.0746 0.0930 0.0773 0.0866 0.0921 0.0938 0.0897 0.0858 0.0781 0.0868 0.0836 0.0912 0.0802 0.0845 0.1098 0.1082 0.1358 0.1090 0.1239 0.1249 0.1222 0.1276 0.1225 0.1189 0.1217
va: 2.1373 2.0976 2.1163 3.6608 3.7932 3.9532 3.9061 3.9144 3.8746 4.2057 3.7457 3.9404 3.9463 3.8722 3.6757 3.8888 4.0236 3.8394 3.9322 4.0543 3.8418 4.0378 3.9425 3.9356 3.9446 3.9958 1.0235 1.0390 1.0047 1.0084 1.0057 1.0176 0.9983 1.0041 1.0154 1.0111 0.9977 0.9987 1.0004 1.0115 1.0001 1.0104 0.9940 1.0214 1.0121 0.9992 1.0132 1.0153 0.9992 0.9988 1.0020 1.0017
dispcorr: -0.025603225 hartree
energy: -1117.873150000987
dipole: -33.88072 33.28042 -0.60030 -7.05182 6.46848 -0.58334 5.87460 -5.64048 0.23412
magnitude: 0.86917 au
magnitude: 2.20926 debye
