program: Orca
programVersion: 5.0.2
elementType: O O O C C C C C C C C C C C C C C C C C C C C C C C H H H H H H H H H H H H H H H H H H H H H H H H H H
charge: 0
multiplicity: 1
keywords: wb97x-d3
keywords: def2-TZVPP
keywords: def2/J RIJCOSX
keywords: DEFGRID2
keywords: scfconv7
keywords: smallprint printgap noloewdin
keywords: NOSOSCF
formula: C23H26O3
InChI: InChI=1/C23H26O3/c1-16(2)13-20-21(23(20,3)4)22(24)25-15-17-9-8-12-19(14-17)26-18-10-6-5-7-11-18/h5-14,20-21H,15H2,1-4H3
52 atoms
O  0.298485 -2.653986 -1.266383
O  -0.112141 -3.14805 0.876308
O  1.140142 2.174228 -0.283883
C  -3.067134 -3.537343 -0.106283
C  -2.902973 -2.156083 0.425652
C  -1.924925 -2.67972 -0.617477
C  -4.159061 -3.810821 -1.113649
C  -2.802897 -4.706553 0.810777
C  -3.818787 -1.03815 0.090617
C  -0.517005 -2.8691 -0.220637
C  -3.496483 0.254668 0.164574
C  -4.491237 1.325998 -0.165005
C  -2.141391 0.745337 0.571997
C  1.688509 -2.589693 -0.981119
C  2.056801 -1.328627 -0.246409
C  1.469486 -0.120056 -0.59942
C  3.008122 -1.35675 0.764078
C  1.816239 1.043948 0.069785
C  3.362573 -0.185078 1.41413
C  2.768561 1.021565 1.081773
C  1.740425 3.395201 -0.176923
C  1.02349 4.414562 0.43094
C  3.002284 3.638503 -0.705826
C  1.570823 5.686839 0.504676
C  3.541827 4.911723 -0.616267
C  2.832221 5.940209 -0.012127
H  -2.469993 -2.116526 1.421841
H  -2.056799 -2.29194 -1.620765
H  -5.110038 -3.998446 -0.610825
H  -3.918584 -4.696179 -1.704323
H  -4.308129 -2.984196 -1.808184
H  -2.471818 -5.57956 0.245302
H  -3.724859 -4.979701 1.32765
H  -2.049611 -4.490015 1.563398
H  -4.82787 -1.299798 -0.214099
H  -4.658232 1.98357 0.691772
H  -5.454644 0.914919 -0.464132
H  -4.128669 1.961048 -0.977258
H  -1.684829 1.338446 -0.224118
H  -1.447334 -0.053957 0.823327
H  -2.215871 1.404716 1.440616
H  2.173012 -2.616427 -1.958443
H  2.017693 -3.46693 -0.419844
H  0.724618 -0.07171 -1.384198
H  3.457022 -2.296657 1.058561
H  4.095284 -0.211538 2.209766
H  3.035406 1.92552 1.613109
H  0.041569 4.20659 0.835572
H  3.555979 2.842076 -1.186381
H  1.0078 6.48142 0.976158
H  4.523618 5.101225 -1.029783
H  3.258315 6.932234 0.050537
totalener: -1117.84647247 hartree
nucrepener: 2261.10868730 hartree
electener: -3378.95515976 hartree
oneelecener: -6011.08920347 hartree
twoeener: 2632.13404370 hartree
kineticenergy: 1112.85597868 hartree
xcener: -110.232459649958 hartree
chargesum: 0.0000000
charge: -0.274878 -0.378166 -0.303024 0.147992 -0.039073 -0.070789 -0.280620 -0.255467 -0.235610 0.300735 0.023608 -0.215472 -0.247031 0.074876 0.099405 -0.332373 -0.167287 0.281932 -0.100148 -0.185248 0.229682 -0.198163 -0.157765 -0.099139 -0.119403 -0.136832 0.103837 0.080147 0.093531 0.091296 0.080581 0.083868 0.082180 0.101763 0.093119 0.085026 0.078191 0.086112 0.085658 0.081517 0.086333 0.103874 0.099694 0.123933 0.104622 0.124747 0.132917 0.124432 0.132964 0.125724 0.126627 0.125564
qa: -0.2749 -0.3782 -0.3030 0.1480 -0.0391 -0.0708 -0.2806 -0.2555 -0.2356 0.3007 0.0236 -0.2155 -0.2470 0.0749 0.0994 -0.3324 -0.1673 0.2819 -0.1001 -0.1852 0.2297 -0.1982 -0.1578 -0.0991 -0.1194 -0.1368 0.1038 0.0801 0.0935 0.0913 0.0806 0.0839 0.0822 0.1018 0.0931 0.0850 0.0782 0.0861 0.0857 0.0815 0.0863 0.1039 0.0997 0.1239 0.1046 0.1247 0.1329 0.1244 0.1330 0.1257 0.1266 0.1256
va: 2.1100 2.1176 2.0757 3.7457 3.8481 3.7977 3.9138 3.8923 3.8923 4.2255 3.7131 3.9399 3.9557 3.8603 3.6419 4.0441 4.0310 3.7427 3.9665 3.9792 3.8265 4.0237 3.9634 3.9376 3.9544 3.9531 1.0241 1.0347 0.9998 1.0065 1.0047 1.0027 1.0016 1.0229 1.0096 0.9985 1.0101 0.9985 1.0064 1.0143 1.0028 0.9879 1.0117 1.0277 1.0129 1.0008 1.0048 1.0101 1.0040 0.9996 0.9998 1.0003
dispcorr: -0.025763769 hartree
energy: -1117.872236234510
dipole: -21.57515 21.76795 0.19280 -6.29305 6.78734 0.49428 0.66750 -1.00850 -0.34100
magnitude: 0.63069 au
magnitude: 1.60309 debye
