program: Orca
programVersion: 5.0.2
elementType: O O O C C C C C C C C C C C C C C C C C C C C C C C H H H H H H H H H H H H H H H H H H H H H H H H H H
charge: 0
multiplicity: 1
keywords: wb97x-d3
keywords: def2-TZVPP
keywords: def2/J RIJCOSX
keywords: DEFGRID2
keywords: scfconv7
keywords: smallprint printgap noloewdin
keywords: NOSOSCF
formula: C23H26O3
InChI: InChI=1/C23H26O3/c1-16(2)13-20-21(23(20,3)4)22(24)25-15-17-9-8-12-19(14-17)26-18-10-6-5-7-11-18/h5-14,20-21H,15H2,1-4H3
52 atoms
O  0.311172 -2.602231 0.359973
O  -0.491087 -0.749964 1.323547
O  3.034195 2.479624 -0.618454
C  -3.232575 -2.275602 1.205424
C  -3.119726 -1.377455 0.022657
C  -1.987462 -2.340643 0.340313
C  -4.130632 -3.487145 1.11766
C  -3.180972 -1.674116 2.588656
C  -3.925318 -1.563264 -1.210672
C  -0.681125 -1.789472 0.747806
C  -3.518372 -1.247907 -2.441375
C  -4.403806 -1.452912 -3.633128
C  -2.167119 -0.674167 -2.741655
C  1.638373 -2.104376 0.506199
C  1.924836 -1.014454 -0.489806
C  2.349284 0.231744 -0.055004
C  1.748875 -1.25115 -1.849358
C  2.588617 1.24452 -0.976193
C  1.99747 -0.238429 -2.761206
C  2.41126 1.012676 -2.332715
C  2.686059 3.029213 0.582248
C  3.672536 3.726602 1.264587
C  1.394143 2.956223 1.089788
C  3.362967 4.359511 2.4583
C  1.102555 3.584425 2.290434
C  2.07993 4.287796 2.979487
H  -2.880666 -0.345912 0.270105
H  -1.920035 -3.212574 -0.299624
H  -4.119458 -3.94532 0.128783
H  -5.163849 -3.220247 1.349025
H  -3.817516 -4.245969 1.836248
H  -4.191414 -1.417541 2.912333
H  -2.576417 -0.772404 2.634903
H  -2.77635 -2.386955 3.3093
H  -4.926569 -1.96585 -1.086032
H  -4.599682 -0.507656 -4.144818
H  -5.362943 -1.891865 -3.361573
H  -3.928767 -2.109853 -4.365855
H  -1.558474 -0.508183 -1.8559
H  -2.261267 0.281649 -3.262611
H  -1.606852 -1.334043 -3.409191
H  2.277226 -2.969896 0.327941
H  1.816593 -1.756945 1.525902
H  2.469707 0.414078 1.00537
H  1.412899 -2.220796 -2.194208
H  1.861462 -0.419193 -3.819343
H  2.599288 1.809946 -3.0396
H  4.672448 3.773354 0.853694
H  0.62344 2.406439 0.564854
H  4.134504 4.904266 2.986232
H  0.097691 3.521916 2.686239
H  1.842421 4.77688 3.914429
totalener: -1117.84674664 hartree
nucrepener: 2272.48998528 hartree
electener: -3390.33673192 hartree
oneelecener: -6033.89037691 hartree
twoeener: 2643.55364499 hartree
kineticenergy: 1112.86270485 hartree
xcener: -110.233558396073 hartree
chargesum: 0.0000000
charge: -0.265401 -0.394089 -0.299249 0.139957 -0.034945 -0.084397 -0.276604 -0.255733 -0.237796 0.321413 0.005645 -0.212109 -0.226344 0.064876 0.039741 -0.156298 -0.263232 0.254773 -0.060321 -0.220630 0.261929 -0.219812 -0.172104 -0.088843 -0.107927 -0.148936 0.104633 0.081769 0.083583 0.091396 0.090701 0.082238 0.099483 0.084858 0.093105 0.087503 0.078735 0.084324 0.082206 0.090392 0.080660 0.111276 0.098580 0.118285 0.113813 0.122348 0.124030 0.122920 0.134595 0.123385 0.127495 0.124123
qa: -0.2654 -0.3941 -0.2992 0.1400 -0.0349 -0.0844 -0.2766 -0.2557 -0.2378 0.3214 0.0056 -0.2121 -0.2263 0.0649 0.0397 -0.1563 -0.2632 0.2548 -0.0603 -0.2206 0.2619 -0.2198 -0.1721 -0.0888 -0.1079 -0.1489 0.1046 0.0818 0.0836 0.0914 0.0907 0.0822 0.0995 0.0849 0.0931 0.0875 0.0787 0.0843 0.0822 0.0904 0.0807 0.1113 0.0986 0.1183 0.1138 0.1223 0.1240 0.1229 0.1346 0.1234 0.1275 0.1241
va: 2.1177 2.0999 2.1131 3.7331 3.8415 3.7929 3.9125 3.8970 3.8960 4.2162 3.7415 3.9403 3.9495 3.8611 3.6630 3.9182 3.9860 3.8410 3.8827 4.0498 3.7924 4.0454 3.9489 3.9276 3.9451 3.9605 1.0247 1.0339 1.0045 1.0007 1.0067 1.0016 1.0235 1.0025 1.0099 0.9986 1.0098 0.9989 1.0113 1.0025 1.0019 0.9892 1.0130 1.0167 1.0183 0.9990 1.0132 1.0148 1.0080 0.9991 0.9996 1.0005
dispcorr: -0.025672678 hartree
energy: -1117.872419318825
dipole: -26.17669 25.82600 -0.35069 -12.24557 11.67576 -0.56982 -4.02020 3.80021 -0.21999
magnitude: 0.70432 au
magnitude: 1.79025 debye
