program: Orca
programVersion: 5.0.2
elementType: O O O C C C C C C C C C C C C C C C C C C C C C C C H H H H H H H H H H H H H H H H H H H H H H H H H H
charge: 0
multiplicity: 1
keywords: wb97x-d3
keywords: def2-TZVPP
keywords: def2/J RIJCOSX
keywords: DEFGRID2
keywords: scfconv7
keywords: smallprint printgap noloewdin
keywords: NOSOSCF
formula: C23H26O3
InChI: InChI=1/C23H26O3/c1-16(2)13-20-21(23(20,3)4)22(24)25-15-17-9-8-12-19(14-17)26-18-10-6-5-7-11-18/h5-14,20-21H,15H2,1-4H3
52 atoms
O  0.149691 -2.120777 -1.627086
O  -0.545199 -0.119739 -0.906538
O  3.830718 1.773956 0.581413
C  -2.209266 -2.008675 1.007641
C  -3.093495 -1.340184 -0.004831
C  -1.856181 -2.071654 -0.467419
C  -2.65074 -3.305872 1.641136
C  -1.404902 -1.141271 1.945457
C  -4.424897 -1.861721 -0.37063
C  -0.711455 -1.306985 -1.005716
C  -5.569886 -1.176176 -0.399157
C  -6.850867 -1.835909 -0.815547
C  -5.703819 0.27243 -0.039032
C  1.368881 -1.538668 -2.085824
C  2.26821 -1.171564 -0.938923
C  2.637201 0.14958 -0.740874
C  2.706696 -2.151494 -0.053688
C  3.424267 0.495065 0.350203
C  3.506732 -1.801587 1.021137
C  3.86209 -0.478499 1.235106
C  2.982548 2.828571 0.410483
C  3.575575 4.051253 0.122417
C  1.60369 2.734895 0.559104
C  2.787223 5.181416 -0.016433
C  0.827798 3.874177 0.4047
C  1.408876 5.099857 0.118746
H  -2.987881 -0.261325 -0.033323
H  -2.003881 -3.041501 -0.930657
H  -3.322919 -3.11179 2.478806
H  -1.789142 -3.854851 2.025029
H  -3.174354 -3.962072 0.947469
H  -1.150524 -0.174817 1.516909
H  -0.473618 -1.634581 2.231463
H  -1.976245 -0.959791 2.857614
H  -4.465568 -2.909346 -0.654924
H  -7.28679 -1.333886 -1.683144
H  -7.597792 -1.784742 -0.01931
H  -6.708744 -2.88455 -1.074197
H  -6.448443 0.402268 0.749371
H  -6.054896 0.853112 -0.894766
H  -4.778624 0.722919 0.310452
H  1.170157 -0.670652 -2.7180
H  1.823608 -2.311352 -2.706117
H  2.283431 0.911921 -1.4233
H  2.419656 -3.185108 -0.20124
H  3.850993 -2.562535 1.708946
H  4.475985 -0.195569 2.079858
H  4.650667 4.107849 0.013097
H  1.126946 1.788628 0.778122
H  3.256202 6.130726 -0.239575
H  -0.245795 3.793704 0.511713
H  0.794485 5.982135 0.001751
totalener: -1117.84769856 hartree
nucrepener: 2245.65884505 hartree
electener: -3363.50654360 hartree
oneelecener: -5980.15667714 hartree
twoeener: 2616.65013353 hartree
kineticenergy: 1112.86526479 hartree
xcener: -110.235011761327 hartree
chargesum: -0.0000000
charge: -0.264509 -0.392820 -0.299282 0.090470 0.044627 -0.092547 -0.245442 -0.246108 -0.192233 0.341095 -0.046372 -0.204604 -0.237330 0.057385 0.027141 -0.173653 -0.227973 0.261410 -0.072154 -0.219264 0.280217 -0.228045 -0.173150 -0.086811 -0.121745 -0.148912 0.089238 0.070957 0.092202 0.091175 0.070771 0.082812 0.087764 0.087728 0.071456 0.084370 0.083747 0.076277 0.083302 0.088937 0.082096 0.100838 0.114071 0.123120 0.113889 0.124213 0.124556 0.121495 0.135292 0.123026 0.124998 0.122283
qa: -0.2645 -0.3928 -0.2993 0.0905 0.0446 -0.0925 -0.2454 -0.2461 -0.1922 0.3411 -0.0464 -0.2046 -0.2373 0.0574 0.0271 -0.1737 -0.2280 0.2614 -0.0722 -0.2193 0.2802 -0.2280 -0.1731 -0.0868 -0.1217 -0.1489 0.0892 0.0710 0.0922 0.0912 0.0708 0.0828 0.0878 0.0877 0.0715 0.0844 0.0837 0.0763 0.0833 0.0889 0.0821 0.1008 0.1141 0.1231 0.1139 0.1242 0.1246 0.1215 0.1353 0.1230 0.1250 0.1223
va: 2.1270 2.1097 2.1174 3.7505 3.7845 3.8576 3.9114 3.9164 3.9051 4.2553 3.8202 3.9363 3.9472 3.8629 3.6460 3.9360 4.0092 3.8280 3.9059 4.0567 3.7939 4.0338 3.9304 3.9328 3.9603 3.9620 1.0349 1.0385 1.0045 1.0042 1.0105 1.0215 1.0035 1.0032 1.0210 0.9979 0.9985 1.0121 0.9998 0.9986 1.0149 1.0106 0.9900 1.0154 1.0167 0.9988 1.0131 1.0160 0.9996 0.9988 1.0003 1.0008
dispcorr: -0.024599733 hartree
energy: -1117.872298289188
dipole: -32.55239 32.00398 -0.54841 -9.54508 8.90677 -0.63830 5.46410 -5.44390 0.02020
magnitude: 0.84178 au
magnitude: 2.13963 debye
