program: Orca
programVersion: 5.0.2
elementType: O O O C C C C C C C C C C C C C C C C C C C C C C C H H H H H H H H H H H H H H H H H H H H H H H H H H
charge: 0
multiplicity: 1
keywords: wb97x-d3
keywords: def2-TZVPP
keywords: def2/J RIJCOSX
keywords: DEFGRID2
keywords: scfconv7
keywords: smallprint printgap noloewdin
keywords: NOSOSCF
formula: C23H26O3
InChI: InChI=1/C23H26O3/c1-16(2)13-20-21(23(20,3)4)22(24)25-15-17-9-8-12-19(14-17)26-18-10-6-5-7-11-18/h5-14,20-21H,15H2,1-4H3
52 atoms
O  0.163766 -2.120671 -1.64403
O  -0.54016 -0.119613 -0.932151
O  3.837815 1.779445 0.595319
C  -2.222679 -2.01223 0.96184
C  -3.097362 -1.343271 -0.058711
C  -1.857077 -2.071866 -0.511028
C  -2.677469 -3.309957 1.584095
C  -1.429319 -1.148535 1.911762
C  -4.42883 -1.868054 -0.427031
C  -0.706568 -1.306341 -1.035616
C  -5.592549 -1.226995 -0.303011
C  -6.878206 -1.873461 -0.725136
C  -5.741452 0.154721 0.258101
C  1.39236 -1.540009 -2.077937
C  2.266124 -1.16704 -0.913171
C  2.652191 0.1511 -0.728858
C  2.664474 -2.137993 0.00039
C  3.4159 0.503382 0.376553
C  3.440643 -1.781613 1.090468
C  3.812785 -0.46091 1.290398
C  3.013279 2.844374 0.378765
C  3.634344 4.049149 0.075069
C  1.629913 2.778078 0.497873
C  2.86945 5.189091 -0.108249
C  0.878014 3.926516 0.299463
C  1.487248 5.134712 -0.002146
H  -2.994384 -0.263691 -0.0855
H  -1.998139 -3.041953 -0.97606
H  -3.202174 -3.955562 0.881344
H  -3.355119 -3.116134 2.417436
H  -1.823475 -3.868511 1.971047
H  -1.162188 -0.184075 1.486512
H  -0.505867 -1.646461 2.214603
H  -2.015444 -0.962698 2.813714
H  -4.452312 -2.872423 -0.840485
H  -7.387822 -1.275522 -1.48485
H  -7.569355 -1.960489 0.117061
H  -6.722033 -2.870637 -1.134743
H  -6.389622 0.140666 1.138317
H  -6.217809 0.819447 -0.466993
H  -4.798294 0.607418 0.556083
H  1.207495 -0.67484 -2.718238
H  1.861162 -2.315103 -2.684699
H  2.329893 0.906716 -1.434059
H  2.364272 -3.169304 -0.136381
H  3.75263 -2.535389 1.801184
H  4.407786 -0.172711 2.14682
H  4.71244 4.084403 -0.011228
H  1.131811 1.845524 0.728293
H  3.359999 6.124547 -0.343207
H  -0.198929 3.867491 0.384422
H  0.891543 6.024532 -0.153613
totalener: -1117.84750499 hartree
nucrepener: 2244.54058247 hartree
electener: -3362.38808746 hartree
oneelecener: -5977.92886915 hartree
twoeener: 2615.54078169 hartree
kineticenergy: 1112.86341235 hartree
xcener: -110.234267127597 hartree
chargesum: -0.0000000
charge: -0.264863 -0.391051 -0.299369 0.105868 0.031341 -0.107179 -0.239492 -0.250078 -0.193917 0.340684 -0.040909 -0.207104 -0.236965 0.058170 0.031618 -0.175000 -0.231639 0.262226 -0.070854 -0.219899 0.278769 -0.227686 -0.173250 -0.087070 -0.122504 -0.148791 0.091371 0.071365 0.071148 0.090704 0.091399 0.084246 0.087135 0.087338 0.075326 0.084929 0.084109 0.076905 0.084808 0.087303 0.082399 0.100554 0.113686 0.122026 0.114156 0.124075 0.124604 0.121775 0.136586 0.123041 0.125617 0.122335
qa: -0.2649 -0.3911 -0.2994 0.1059 0.0313 -0.1072 -0.2395 -0.2501 -0.1939 0.3407 -0.0409 -0.2071 -0.2370 0.0582 0.0316 -0.1750 -0.2316 0.2622 -0.0709 -0.2199 0.2788 -0.2277 -0.1732 -0.0871 -0.1225 -0.1488 0.0914 0.0714 0.0711 0.0907 0.0914 0.0842 0.0871 0.0873 0.0753 0.0849 0.0841 0.0769 0.0848 0.0873 0.0824 0.1006 0.1137 0.1220 0.1142 0.1241 0.1246 0.1218 0.1366 0.1230 0.1256 0.1223
va: 2.1264 2.1117 2.1171 3.7435 3.7827 3.8841 3.9070 3.9146 3.8983 4.2538 3.8045 3.9372 3.9475 3.8623 3.6460 3.9388 4.0080 3.8282 3.9041 4.0568 3.7923 4.0347 3.9305 3.9329 3.9607 3.9617 1.0336 1.0393 1.0103 1.0054 1.0044 1.0214 1.0039 1.0033 1.0192 0.9983 0.9981 1.0119 0.9995 0.9994 1.0140 1.0107 0.9899 1.0152 1.0171 0.9988 1.0131 1.0159 0.9993 0.9988 1.0002 1.0008
dispcorr: -0.024694526 hartree
energy: -1117.872199517490
dipole: -32.75513 32.19483 -0.56030 -9.81687 9.17810 -0.63877 6.01408 -5.96761 0.04646
magnitude: 0.85096 au
magnitude: 2.16296 debye
