program: Orca
programVersion: 5.0.2
elementType: O O O C C C C C C C C C C C C C C C C C C C C C C C H H H H H H H H H H H H H H H H H H H H H H H H H H
charge: 0
multiplicity: 1
keywords: wb97x-d3
keywords: def2-TZVPP
keywords: def2/J RIJCOSX
keywords: DEFGRID2
keywords: scfconv7
keywords: smallprint printgap noloewdin
keywords: NOSOSCF
formula: C23H26O3
InChI: InChI=1/C23H26O3/c1-16(2)13-20-21(23(20,3)4)22(24)25-15-17-9-8-12-19(14-17)26-18-10-6-5-7-11-18/h5-14,20-21H,15H2,1-4H3
52 atoms
O  0.312984 -2.709856 0.525077
O  -0.262244 -1.901939 -1.479439
O  3.120643 1.398975 1.45155
C  -2.287457 -0.310645 0.379447
C  -2.987015 -1.336261 -0.464835
C  -1.790051 -1.745615 0.357093
C  -2.929579 0.148506 1.666822
C  -1.509155 0.782949 -0.310382
C  -4.322936 -1.865618 -0.126168
C  -0.531307 -2.109185 -0.327234
C  -5.402147 -1.85989 -0.911433
C  -6.700877 -2.440179 -0.436668
C  -5.441975 -1.289902 -2.296987
C  1.610701 -3.007767 0.027251
C  2.436301 -1.771216 -0.197405
C  2.400132 -0.730343 0.724951
C  3.247422 -1.660973 -1.316802
C  3.16924 0.400414 0.518092
C  4.029772 -0.530808 -1.505985
C  3.995918 0.508112 -0.592586
C  2.624298 2.615042 1.089542
C  1.819237 2.809207 -0.026848
C  2.937481 3.683841 1.921505
C  1.336301 4.080901 -0.302764
C  2.443706 4.944748 1.633647
C  1.643835 5.153566 0.518388
H  -2.767996 -1.253835 -1.523948
H  -1.98217 -2.308096 1.264885
H  -3.461666 -0.647887 2.185294
H  -3.647837 0.94615 1.469812
H  -2.175123 0.541024 2.35047
H  -1.060856 0.459054 -1.246918
H  -0.711625 1.160832 0.332871
H  -2.173018 1.620822 -0.531078
H  -4.426995 -2.305777 0.861665
H  -7.041318 -3.240406 -1.09883
H  -7.490207 -1.683933 -0.43164
H  -6.623736 -2.84987 0.570018
H  -4.491923 -0.875488 -2.626033
H  -6.185719 -0.491294 -2.359852
H  -5.742748 -2.050704 -3.021598
H  1.55059 -3.597373 -0.890644
H  2.063636 -3.633113 0.798174
H  1.768619 -0.785351 1.60306
H  3.259201 -2.454387 -2.053289
H  4.66228 -0.452922 -2.380192
H  4.596011 1.396617 -0.740399
H  1.564861 1.984565 -0.679516
H  3.564399 3.517369 2.787689
H  0.709636 4.225759 -1.173028
H  2.692168 5.772301 2.285116
H  1.264497 6.141094 0.294042
totalener: -1117.84716299 hartree
nucrepener: 2255.53773760 hartree
electener: -3373.38490059 hartree
oneelecener: -5999.79627698 hartree
twoeener: 2626.41137639 hartree
kineticenergy: 1112.86321348 hartree
xcener: -110.234234840648 hartree
chargesum: 0.0000000
charge: -0.272949 -0.371934 -0.301861 0.113547 0.036701 -0.100887 -0.240622 -0.278643 -0.190923 0.320766 -0.046268 -0.205755 -0.235283 0.065138 0.058660 -0.261440 -0.142405 0.224932 -0.104254 -0.154866 0.288399 -0.214793 -0.209912 -0.131536 -0.093076 -0.146929 0.090307 0.072169 0.070944 0.090932 0.094337 0.101677 0.085765 0.090644 0.073500 0.084557 0.083745 0.076182 0.083139 0.084251 0.086252 0.101082 0.107493 0.120939 0.105090 0.126684 0.132298 0.139808 0.122754 0.125178 0.123269 0.123198
qa: -0.2729 -0.3719 -0.3019 0.1135 0.0367 -0.1009 -0.2406 -0.2786 -0.1909 0.3208 -0.0463 -0.2058 -0.2353 0.0651 0.0587 -0.2614 -0.1424 0.2249 -0.1043 -0.1549 0.2884 -0.2148 -0.2099 -0.1315 -0.0931 -0.1469 0.0903 0.0722 0.0709 0.0909 0.0943 0.1017 0.0858 0.0906 0.0735 0.0846 0.0837 0.0762 0.0831 0.0843 0.0863 0.1011 0.1075 0.1209 0.1051 0.1267 0.1323 0.1398 0.1228 0.1252 0.1233 0.1232
va: 2.1164 2.1314 2.1010 3.7382 3.7960 3.8820 3.9079 3.9114 3.8992 4.2602 3.8146 3.9366 3.9464 3.8636 3.6507 4.0366 4.0147 3.8348 3.9458 3.9955 3.7629 3.8928 4.0254 3.9756 3.9450 3.9632 1.0374 1.0385 1.0099 1.0052 1.0048 1.0174 1.0005 1.0051 1.0198 0.9982 0.9982 1.0121 1.0148 0.9994 0.9993 1.0096 0.9888 1.0292 1.0130 1.0002 1.0029 1.0011 1.0151 1.0011 0.9987 1.0005
dispcorr: -0.025312871 hartree
energy: -1117.872475857893
dipole: -31.33832 31.01866 -0.31966 -0.95666 0.94855 -0.00812 -3.99611 4.06898 0.07287
magnitude: 0.32796 au
magnitude: 0.83361 debye
