program: Orca
programVersion: 5.0.2
elementType: O O O C C C C C C C C C C C C C C C C C C C C C C C H H H H H H H H H H H H H H H H H H H H H H H H H H
charge: 0
multiplicity: 1
keywords: wb97x-d3
keywords: def2-TZVPP
keywords: def2/J RIJCOSX
keywords: DEFGRID2
keywords: scfconv7
keywords: smallprint printgap noloewdin
keywords: NOSOSCF
formula: C23H26O3
InChI: InChI=1/C23H26O3/c1-16(2)13-20-21(23(20,3)4)22(24)25-15-17-9-8-12-19(14-17)26-18-10-6-5-7-11-18/h5-14,20-21H,15H2,1-4H3
52 atoms
O  0.092406 -2.023074 -1.698731
O  -0.617758 -0.018182 -1.004086
O  3.968074 1.751808 0.57152
C  -2.420587 -1.907349 0.784668
C  -3.236844 -1.228182 -0.273105
C  -1.982771 -1.956273 -0.671591
C  -2.902018 -3.216862 1.359562
C  -1.660776 -1.06143 1.777763
C  -4.553577 -1.740765 -0.734883
C  -0.796795 -1.20077 -1.126125
C  -5.686448 -1.691819 -0.033148
C  -6.976785 -2.206678 -0.595225
C  -5.774355 -1.120666 1.348985
C  1.345964 -1.455107 -2.065157
C  2.171262 -1.102433 -0.858771
C  2.686786 0.176518 -0.7241
C  2.41124 -2.051618 0.13043
C  3.423984 0.514418 0.403722
C  3.158862 -1.710438 1.245037
C  3.662141 -0.426605 1.393262
C  3.254012 2.877658 0.282196
C  3.993713 4.004541 -0.05362
C  1.867578 2.944908 0.359206
C  3.344302 5.200891 -0.308813
C  1.23256 4.148198 0.089975
C  1.960852 5.279937 -0.242724
H  -3.132307 -0.145618 -0.291043
H  -2.107779 -2.923466 -1.147449
H  -2.05888 -3.806816 1.723329
H  -3.445985 -3.816505 0.631346
H  -3.571831 -3.04325 2.204113
H  -1.384925 -0.087109 1.381655
H  -0.745238 -1.561666 2.099527
H  -2.274409 -0.897132 2.666003
H  -4.58607 -2.1613 -1.736078
H  -7.724821 -1.412027 -0.651023
H  -7.399514 -2.986993 0.042477
H  -6.852536 -2.620155 -1.595159
H  -6.470103 -0.277979 1.3746
H  -4.814835 -0.770556 1.724102
H  -6.162608 -1.862401 2.051641
H  1.204792 -0.58057 -2.704057
H  1.834945 -2.229572 -2.657173
H  2.486904 0.91809 -1.487659
H  2.010284 -3.052658 0.034117
H  3.346204 -2.446751 2.015427
H  4.236246 -0.149914 2.267512
H  5.072245 3.935716 -0.108132
H  1.27838 2.073614 0.613652
H  3.926492 6.075096 -0.568966
H  0.153057 4.193812 0.145226
H  1.455744 6.213439 -0.450003
totalener: -1117.84673744 hartree
nucrepener: 2238.01715505 hartree
electener: -3355.86389249 hartree
oneelecener: -5964.89479576 hartree
twoeener: 2609.03090327 hartree
kineticenergy: 1112.86342249 hartree
xcener: -110.234028620760 hartree
chargesum: 0.0000000
charge: -0.267949 -0.384216 -0.299265 0.054542 -0.021731 -0.074911 -0.251419 -0.248053 -0.197063 0.331238 -0.016127 -0.210409 -0.248784 0.064332 0.051076 -0.179599 -0.243585 0.254990 -0.067307 -0.217758 0.277119 -0.229216 -0.174762 -0.085073 -0.122150 -0.152013 0.107114 0.081283 0.097929 0.084986 0.083050 0.093926 0.088820 0.082159 0.088143 0.086997 0.083872 0.079578 0.098808 0.084655 0.088613 0.100165 0.111236 0.118961 0.115910 0.124074 0.124429 0.121753 0.138755 0.122849 0.127259 0.122769
qa: -0.2679 -0.3842 -0.2993 0.0545 -0.0217 -0.0749 -0.2514 -0.2481 -0.1971 0.3312 -0.0161 -0.2104 -0.2488 0.0643 0.0511 -0.1796 -0.2436 0.2550 -0.0673 -0.2178 0.2771 -0.2292 -0.1748 -0.0851 -0.1222 -0.1520 0.1071 0.0813 0.0979 0.0850 0.0831 0.0939 0.0888 0.0822 0.0881 0.0870 0.0839 0.0796 0.0988 0.0847 0.0886 0.1002 0.1112 0.1190 0.1159 0.1241 0.1244 0.1218 0.1388 0.1228 0.1273 0.1228
va: 2.1208 2.1203 2.1141 3.7627 3.8196 3.7953 3.9009 3.9052 3.8713 4.2689 3.7340 3.9365 3.9344 3.8596 3.6458 3.9533 4.0026 3.8364 3.8991 4.0574 3.7873 4.0369 3.9281 3.9311 3.9597 3.9634 1.0260 1.0340 1.0060 1.0071 1.0023 1.0208 1.0050 1.0048 1.0136 0.9981 0.9992 1.0105 1.0043 1.0097 0.9981 1.0115 0.9891 1.0140 1.0185 0.9988 1.0129 1.0159 1.0020 0.9989 0.9999 1.0008
dispcorr: -0.025474959 hartree
energy: -1117.872212398425
dipole: -33.55887 32.92633 -0.63253 -12.22697 11.53442 -0.69255 7.67715 -7.58514 0.09201
magnitude: 0.94244 au
magnitude: 2.39549 debye
