program: Orca
programVersion: 5.0.2
elementType: O O O C C C C C C C C C C C C C C C C C C C C C C C H H H H H H H H H H H H H H H H H H H H H H H H H H
charge: 0
multiplicity: 1
keywords: wb97x-d3
keywords: def2-TZVPP
keywords: def2/J RIJCOSX
keywords: DEFGRID2
keywords: scfconv7
keywords: smallprint printgap noloewdin
keywords: NOSOSCF
formula: C23H26O3
InChI: InChI=1/C23H26O3/c1-16(2)13-20-21(23(20,3)4)22(24)25-15-17-9-8-12-19(14-17)26-18-10-6-5-7-11-18/h5-14,20-21H,15H2,1-4H3
52 atoms
O  -0.040187 -1.298817 1.616773
O  -0.305696 -2.48977 -0.257769
O  3.680332 1.905234 0.013285
C  -2.294064 -0.153904 -0.938184
C  -3.061169 -1.361282 -0.518875
C  -1.938279 -0.85413 0.363411
C  -2.919573 1.211786 -0.780021
C  -1.378995 -0.254417 -2.134417
C  -4.470525 -1.287543 -0.055055
C  -0.698624 -1.643269 0.500594
C  -5.032267 -2.11937 0.823323
C  -6.474195 -1.991887 1.211467
C  -4.290287 -3.239849 1.484609
C  1.220202 -1.921535 1.832505
C  2.294845 -1.349937 0.950212
C  2.458333 0.027355 0.867435
C  3.149875 -2.184977 0.243393
C  3.472043 0.556681 0.082704
C  4.174478 -1.647268 -0.519779
C  4.337863 -0.274391 -0.611817
C  2.64631 2.724993 -0.32702
C  1.644269 2.339314 -1.20942
C  2.65283 4.005396 0.210569
C  0.6500 3.245319 -1.546324
C  1.655146 4.900864 -0.139517
C  0.646431 4.526332 -1.015313
H  -2.800812 -2.264551 -1.065557
H  -2.236384 -0.325112 1.261199
H  -2.144693 1.975781 -0.693744
H  -3.550963 1.2837 0.10549
H  -3.535334 1.458118 -1.647906
H  -1.924373 0.025744 -3.037631
H  -0.982119 -1.255291 -2.282836
H  -0.533231 0.42832 -2.033382
H  -5.089364 -0.51054 -0.494639
H  -6.57961 -1.853795 2.290423
H  -7.0305 -2.897967 0.958915
H  -6.960122 -1.152083 0.716179
H  -3.253934 -3.315056 1.162575
H  -4.774275 -4.197296 1.276576
H  -4.296901 -3.120091 2.57101
H  1.150814 -3.003253 1.699731
H  1.447945 -1.725642 2.881315
H  1.797023 0.691271 1.411748
H  3.009525 -3.257356 0.28446
H  4.840364 -2.301512 -1.066593
H  5.126838 0.155763 -1.214382
H  1.641602 1.345208 -1.638057
H  3.44049 4.291331 0.895234
H  -0.124655 2.944011 -2.240019
H  1.665166 5.897213 0.282519
H  -0.131742 5.227179 -1.285112
totalener: -1117.84666609 hartree
nucrepener: 2287.59347363 hartree
electener: -3405.44013972 hartree
oneelecener: -6063.84139608 hartree
twoeener: 2658.40125637 hartree
kineticenergy: 1112.86246787 hartree
xcener: -110.233482917321 hartree
chargesum: 0.0000000
charge: -0.271988 -0.381020 -0.302356 0.160505 -0.041321 -0.093831 -0.288596 -0.251646 -0.232723 0.327129 -0.003534 -0.210206 -0.228097 0.069129 0.035854 -0.202302 -0.142745 0.206409 -0.095228 -0.195428 0.226811 -0.122559 -0.207821 -0.157876 -0.089899 -0.147553 0.105468 0.082434 0.091095 0.084522 0.091470 0.089385 0.107672 0.050029 0.093980 0.084113 0.086688 0.077991 0.081175 0.089894 0.085946 0.099447 0.108355 0.125741 0.106912 0.124758 0.126709 0.138456 0.124350 0.136464 0.123806 0.124032
qa: -0.2720 -0.3810 -0.3024 0.1605 -0.0413 -0.0938 -0.2886 -0.2516 -0.2327 0.3271 -0.0035 -0.2102 -0.2281 0.0691 0.0359 -0.2023 -0.1427 0.2064 -0.0952 -0.1954 0.2268 -0.1226 -0.2078 -0.1579 -0.0899 -0.1476 0.1055 0.0824 0.0911 0.0845 0.0915 0.0894 0.1077 0.0500 0.0940 0.0841 0.0867 0.0780 0.0812 0.0899 0.0859 0.0994 0.1084 0.1257 0.1069 0.1248 0.1267 0.1385 0.1243 0.1365 0.1238 0.1240
va: 2.1132 2.1195 2.1016 3.6916 3.8535 3.8094 3.9179 3.8912 3.8956 4.2162 3.7315 3.9418 3.9444 3.8625 3.6818 3.9540 4.0011 3.8375 3.9403 4.0405 3.8542 3.8742 4.0291 3.9410 3.9478 3.9770 1.0255 1.0342 1.0108 1.0072 0.9990 1.0030 1.0254 1.0189 1.0092 0.9991 0.9986 1.0099 1.0178 1.0013 1.0008 1.0125 0.9891 1.0212 1.0138 0.9998 1.0110 0.9998 1.0139 0.9921 0.9983 1.0016
dispcorr: -0.026476270 hartree
energy: -1117.873142359154
dipole: -29.99222 29.45967 -0.53254 -5.38743 5.53475 0.14732 -1.26749 1.63278 0.36530
magnitude: 0.66238 au
magnitude: 1.68364 debye
