program: Orca
programVersion: 5.0.2
elementType: O O O C C C C C C C C C C C C C C C C C C C C C C C H H H H H H H H H H H H H H H H H H H H H H H H H H
charge: 0
multiplicity: 1
keywords: wb97x-d3
keywords: def2-TZVPP
keywords: def2/J RIJCOSX
keywords: DEFGRID2
keywords: scfconv7
keywords: smallprint printgap noloewdin
keywords: NOSOSCF
formula: C23H26O3
InChI: InChI=1/C23H26O3/c1-16(2)13-20-21(23(20,3)4)22(24)25-15-17-9-8-12-19(14-17)26-18-10-6-5-7-11-18/h5-14,20-21H,15H2,1-4H3
52 atoms
O  0.015486 -1.385838 1.524482
O  -0.30559 -2.515505 -0.380024
O  3.627372 1.908932 -0.017601
C  -2.254979 -0.129109 -0.963257
C  -3.050637 -1.318338 -0.54405
C  -1.891592 -0.863148 0.317503
C  -2.834144 1.25193 -0.766123
C  -1.36958 -0.23697 -2.180941
C  -4.447564 -1.193028 -0.052786
C  -0.667986 -1.683591 0.408295
C  -4.995587 -1.914071 0.926201
C  -6.426157 -1.721638 1.329917
C  -4.253244 -2.965589 1.691946
C  1.266459 -2.033202 1.703731
C  2.360611 -1.405234 0.884843
C  2.439367 -0.022842 0.770295
C  3.335627 -2.198825 0.294755
C  3.492219 0.553061 0.073816
C  4.392569 -1.612766 -0.384121
C  4.476161 -0.235194 -0.504168
C  2.541747 2.66113 -0.359864
C  1.693268 2.293257 -1.396987
C  2.334141 3.845854 0.331471
C  0.637803 3.124274 -1.738562
C  1.275844 4.668681 -0.022543
C  0.420496 4.311293 -1.053815
H  -2.838363 -2.220233 -1.113874
H  -2.151042 -0.341316 1.231348
H  -3.458092 1.534062 -1.617098
H  -2.034365 1.989834 -0.680416
H  -3.447994 1.323033 0.131719
H  -1.032712 -1.252224 -2.372548
H  -0.485693 0.393546 -2.073475
H  -1.916685 0.104867 -3.061513
H  -5.073397 -0.466867 -0.564283
H  -6.915583 -0.941936 0.747583
H  -6.502312 -1.451009 2.386039
H  -6.99794 -2.644258 1.204111
H  -4.227544 -2.725232 2.757864
H  -3.228882 -3.097545 1.351755
H  -4.759065 -3.930365 1.605473
H  1.192179 -3.100823 1.486453
H  1.486278 -1.922242 2.766985
H  1.686008 0.607994 1.226453
H  3.266361 -3.277126 0.361473
H  5.150282 -2.234867 -0.841626
H  5.292331 0.231302 -1.039619
H  1.860662 1.371436 -1.940105
H  3.004291 4.117627 1.136317
H  -0.016786 2.841475 -2.552886
H  1.117147 5.592026 0.518763
H  -0.40421 4.955222 -1.327559
totalener: -1117.84650398 hartree
nucrepener: 2296.14156826 hartree
electener: -3413.98807224 hartree
oneelecener: -6080.96818983 hartree
twoeener: 2666.98011759 hartree
kineticenergy: 1112.86423648 hartree
xcener: -110.234238685172 hartree
chargesum: -0.0000000
charge: -0.276320 -0.377973 -0.303250 0.160988 -0.027428 -0.113075 -0.285328 -0.256683 -0.237315 0.328498 -0.008870 -0.209935 -0.224511 0.069229 0.054381 -0.182763 -0.169566 0.194890 -0.089919 -0.202932 0.204851 -0.104504 -0.192660 -0.184521 -0.097745 -0.128626 0.106269 0.086266 0.088891 0.092548 0.086516 0.107410 0.054484 0.087712 0.092503 0.078599 0.084172 0.086744 0.086476 0.083357 0.090631 0.101139 0.105774 0.127349 0.106380 0.124825 0.126234 0.138491 0.125763 0.140658 0.124737 0.127158
qa: -0.2763 -0.3780 -0.3032 0.1610 -0.0274 -0.1131 -0.2853 -0.2567 -0.2373 0.3285 -0.0089 -0.2099 -0.2245 0.0692 0.0544 -0.1828 -0.1696 0.1949 -0.0899 -0.2029 0.2049 -0.1045 -0.1927 -0.1845 -0.0977 -0.1286 0.1063 0.0863 0.0889 0.0925 0.0865 0.1074 0.0545 0.0877 0.0925 0.0786 0.0842 0.0867 0.0865 0.0834 0.0906 0.1011 0.1058 0.1273 0.1064 0.1248 0.1262 0.1385 0.1258 0.1407 0.1247 0.1272
va: 2.1093 2.1235 2.0972 3.6820 3.8452 3.8224 3.9175 3.8965 3.8965 4.2054 3.7406 3.9414 3.9410 3.8615 3.6860 3.9248 4.0220 3.8467 3.9427 4.0434 3.8603 3.8675 4.0223 3.9280 3.9479 3.9308 1.0251 1.0326 1.0005 1.0101 1.0076 1.0270 1.0194 1.0022 1.0098 1.0098 0.9993 0.9986 1.0010 1.0159 1.0015 1.0150 0.9873 1.0235 1.0126 0.9994 1.0117 1.0002 1.0129 0.9916 0.9983 0.9997
dispcorr: -0.026810288 hartree
energy: -1117.873314264794
dipole: -29.67856 29.14849 -0.53007 -4.41000 4.63532 0.22532 -0.44323 0.84865 0.40542
magnitude: 0.70435 au
magnitude: 1.79031 debye
