program: Orca
programVersion: 5.0.2
elementType: O O O C C C C C C C C C C C C C C C C C C C C C C C H H H H H H H H H H H H H H H H H H H H H H H H H H
charge: 0
multiplicity: 1
keywords: wb97x-d3
keywords: def2-TZVPP
keywords: def2/J RIJCOSX
keywords: DEFGRID2
keywords: scfconv7
keywords: smallprint printgap noloewdin
keywords: NOSOSCF
formula: C23H26O3
InChI: InChI=1/C23H26O3/c1-16(2)13-20-21(23(20,3)4)22(24)25-15-17-9-8-12-19(14-17)26-18-10-6-5-7-11-18/h5-14,20-21H,15H2,1-4H3
52 atoms
O  0.017099 -1.393033 1.523933
O  -0.3151 -2.520291 -0.38021
O  3.625548 1.912409 -0.014479
C  -2.262278 -0.126693 -0.946912
C  -3.057598 -1.31813 -0.533683
C  -1.896813 -0.869041 0.328724
C  -2.840091 1.253773 -0.741921
C  -1.378687 -0.227997 -2.166598
C  -4.452715 -1.197626 -0.036177
C  -0.673104 -1.690292 0.411929
C  -5.000645 -1.944488 0.923338
C  -6.428788 -1.758634 1.338323
C  -4.259045 -3.020647 1.654992
C  1.270283 -2.038562 1.694677
C  2.359458 -1.406169 0.872588
C  2.439228 -0.023162 0.766511
C  3.330101 -2.196964 0.271341
C  3.489174 0.555954 0.067979
C  4.384183 -1.6079 -0.409252
C  4.469028 -0.229616 -0.52038
C  2.542057 2.667739 -0.356153
C  1.691918 2.303396 -1.39321
C  2.338478 3.852978 0.335678
C  0.638861 3.137921 -1.733786
C  1.282752 4.679444 -0.017525
C  0.425616 4.325335 -1.048465
H  -2.846334 -2.216521 -1.109346
H  -2.154667 -0.352829 1.246244
H  -2.039772 1.991731 -0.66226
H  -3.445813 1.323544 0.161476
H  -3.471525 1.537105 -1.586928
H  -0.491766 0.397492 -2.05456
H  -1.925098 0.124318 -3.043526
H  -1.046972 -1.243121 -2.367631
H  -5.075984 -0.453147 -0.52381
H  -6.917038 -0.959048 0.782509
H  -6.4999 -1.520831 2.402668
H  -7.005183 -2.674362 1.186052
H  -4.77179 -3.979651 1.547756
H  -4.223042 -2.808098 2.726551
H  -3.238127 -3.149903 1.303331
H  1.196963 -3.105688 1.474687
H  1.495404 -1.930272 2.757108
H  1.689522 0.606125 1.230976
H  3.25985 -3.2756 0.331304
H  5.138531 -2.22797 -0.875059
H  5.283133 0.2396 -1.056609
H  1.856125 1.381753 -1.937553
H  3.009955 4.122384 1.140275
H  -0.01676 2.857463 -2.548097
H  1.127657 5.602976 0.52455
H  -0.397158 4.972084 -1.321374
totalener: -1117.84653726 hartree
nucrepener: 2294.96064247 hartree
electener: -3412.80717973 hartree
oneelecener: -6078.60678007 hartree
twoeener: 2665.79960034 hartree
kineticenergy: 1112.86234741 hartree
xcener: -110.233761213226 hartree
chargesum: -0.0000000
charge: -0.275943 -0.378023 -0.303218 0.161501 -0.029355 -0.109648 -0.285619 -0.256032 -0.236476 0.327077 -0.008107 -0.209810 -0.225302 0.069169 0.053820 -0.182889 -0.168828 0.194783 -0.090187 -0.202412 0.204750 -0.104328 -0.192531 -0.184570 -0.097851 -0.128669 0.106114 0.085380 0.092404 0.086154 0.089045 0.054804 0.087575 0.107221 0.092666 0.078383 0.084189 0.086651 0.090309 0.086620 0.082979 0.101109 0.105880 0.127250 0.106495 0.124819 0.126300 0.138430 0.125733 0.140389 0.124721 0.127077
qa: -0.2759 -0.3780 -0.3032 0.1615 -0.0294 -0.1096 -0.2856 -0.2560 -0.2365 0.3271 -0.0081 -0.2098 -0.2253 0.0692 0.0538 -0.1829 -0.1688 0.1948 -0.0902 -0.2024 0.2048 -0.1043 -0.1925 -0.1846 -0.0979 -0.1287 0.1061 0.0854 0.0924 0.0862 0.0890 0.0548 0.0876 0.1072 0.0927 0.0784 0.0842 0.0867 0.0903 0.0866 0.0830 0.1011 0.1059 0.1272 0.1065 0.1248 0.1263 0.1384 0.1257 0.1404 0.1247 0.1271
va: 2.1100 2.1233 2.0970 3.6833 3.8476 3.8192 3.9179 3.8960 3.8966 4.2090 3.7390 3.9416 3.9416 3.8614 3.6862 3.9263 4.0210 3.8467 3.9422 4.0432 3.8599 3.8663 4.0217 3.9286 3.9482 3.9311 1.0252 1.0329 1.0100 1.0075 1.0004 1.0192 1.0022 1.0268 1.0097 1.0098 0.9992 0.9986 1.0016 1.0009 1.0163 1.0151 0.9873 1.0235 1.0126 0.9994 1.0117 1.0002 1.0129 0.9920 0.9983 0.9997
dispcorr: -0.026768988 hartree
energy: -1117.873306252766
dipole: -29.67950 29.15743 -0.52207 -4.52515 4.74628 0.22113 -0.44168 0.84380 0.40213
magnitude: 0.69510 au
magnitude: 1.76680 debye
