program: Orca
programVersion: 5.0.2
elementType: O O O C C C C C C C C C C C C C C C C C C C C C C C H H H H H H H H H H H H H H H H H H H H H H H H H H
charge: 0
multiplicity: 1
keywords: wb97x-d3
keywords: def2-TZVPP
keywords: def2/J RIJCOSX
keywords: DEFGRID2
keywords: scfconv7
keywords: smallprint printgap noloewdin
keywords: NOSOSCF
formula: C23H26O3
InChI: InChI=1/C23H26O3/c1-16(2)13-20-21(23(20,3)4)22(24)25-15-17-9-8-12-19(14-17)26-18-10-6-5-7-11-18/h5-14,20-21H,15H2,1-4H3
52 atoms
O  0.70763 -2.408877 -1.105057
O  0.219839 -2.313979 1.077551
O  3.070048 2.009893 -0.526865
C  -2.73778 -2.131791 0.008002
C  -2.237642 -0.763294 0.348543
C  -1.408823 -1.648833 -0.549869
C  -3.849854 -2.270897 -1.003241
C  -2.780552 -3.184369 1.087455
C  -2.817497 0.486483 -0.209123
C  -0.106816 -2.153701 -0.067319
C  -3.966257 1.042156 0.177561
C  -4.437841 2.3370 -0.412136
C  -4.861087 0.449064 1.222254
C  2.040422 -2.786414 -0.803303
C  2.879517 -1.635224 -0.315436
C  2.573928 -0.330198 -0.670308
C  3.998858 -1.885179 0.470478
C  3.35886 0.715521 -0.203675
C  4.800634 -0.838669 0.894585
C  4.480022 0.471252 0.571834
C  1.813644 2.494368 -0.310516
C  1.421142 3.5715 -1.094749
C  0.959753 1.988722 0.664264
C  0.174567 4.144375 -0.900086
C  -0.287838 2.567747 0.839646
C  -0.689307 3.644277 0.063041
H  -1.834943 -0.676781 1.35537
H  -1.426003 -1.403954 -1.606615
H  -3.802295 -1.509677 -1.780653
H  -4.822729 -2.178814 -0.516248
H  -3.810573 -3.249961 -1.483685
H  -2.660862 -4.18282 0.663159
H  -3.751626 -3.157162 1.585973
H  -2.012968 -3.048331 1.844796
H  -2.226112 0.998117 -0.96254
H  -3.753344 2.712382 -1.171902
H  -4.537717 3.105059 0.359311
H  -5.42405 2.227956 -0.869665
H  -4.487082 -0.495039 1.613785
H  -5.862792 0.274969 0.821528
H  -4.982396 1.135735 2.063981
H  2.43895 -3.170912 -1.743913
H  2.061965 -3.600361 -0.074605
H  1.715194 -0.113859 -1.293491
H  4.238431 -2.900303 0.762271
H  5.670519 -1.039654 1.505537
H  5.08364 1.298082 0.921429
H  2.096428 3.955433 -1.847947
H  1.253863 1.151084 1.283026
H  -0.123552 4.985179 -1.51264
H  -0.952167 2.167606 1.593674
H  -1.665329 4.086819 0.208795
totalener: -1117.84658822 hartree
nucrepener: 2335.53006305 hartree
electener: -3453.37665127 hartree
oneelecener: -6159.80015285 hartree
twoeener: 2706.42350158 hartree
kineticenergy: 1112.86197201 hartree
xcener: -110.236300995541 hartree
chargesum: 0.0000000
charge: -0.280409 -0.375840 -0.301482 0.062182 -0.037139 -0.025930 -0.250078 -0.259834 -0.235470 0.301445 0.005944 -0.238626 -0.251662 0.064404 0.084734 -0.226888 -0.190230 0.237767 -0.087499 -0.206671 0.269353 -0.222130 -0.167682 -0.079786 -0.108912 -0.181767 0.103064 0.082679 0.084938 0.084013 0.097201 0.088731 0.079504 0.103223 0.108165 0.083248 0.086934 0.094274 0.084855 0.090684 0.097200 0.108312 0.102587 0.130843 0.104780 0.124195 0.124684 0.122819 0.137013 0.122557 0.126706 0.128996
qa: -0.2804 -0.3758 -0.3015 0.0622 -0.0371 -0.0259 -0.2501 -0.2598 -0.2355 0.3014 0.0059 -0.2386 -0.2517 0.0644 0.0847 -0.2269 -0.1902 0.2378 -0.0875 -0.2067 0.2694 -0.2221 -0.1677 -0.0798 -0.1089 -0.1818 0.1031 0.0827 0.0849 0.0840 0.0972 0.0887 0.0795 0.1032 0.1082 0.0832 0.0869 0.0943 0.0849 0.0907 0.0972 0.1083 0.1026 0.1308 0.1048 0.1242 0.1247 0.1228 0.1370 0.1226 0.1267 0.1290
va: 2.1154 2.1207 2.1114 3.8142 3.8017 3.7859 3.9056 3.8990 3.8562 4.2450 3.6590 3.9382 3.9418 3.8645 3.6330 3.9761 4.0377 3.8228 3.9396 4.0624 3.7872 4.0392 3.8887 3.9382 3.9047 3.9400 1.0233 1.0346 1.0071 1.0025 1.0064 1.0033 1.0030 1.0224 0.9974 1.0090 0.9962 1.0030 1.0087 0.9980 1.0040 0.9864 1.0111 1.0200 1.0110 0.9994 1.0117 1.0149 1.0086 0.9986 1.0003 0.9960
dispcorr: -0.028630406 hartree
energy: -1117.875218627408
dipole: -32.13511 31.50748 -0.62763 -2.88325 2.69361 -0.18963 2.26280 -2.58204 -0.31924
magnitude: 0.72924 au
magnitude: 1.85359 debye
