program: Orca
programVersion: 5.0.2
elementType: O O O C C C C C C C C C C C C C C C C C C C C C C C H H H H H H H H H H H H H H H H H H H H H H H H H H
charge: 0
multiplicity: 1
keywords: wb97x-d3
keywords: def2-TZVPP
keywords: def2/J RIJCOSX
keywords: DEFGRID2
keywords: scfconv7
keywords: smallprint printgap noloewdin
keywords: NOSOSCF
formula: C23H26O3
InChI: InChI=1/C23H26O3/c1-16(2)13-20-21(23(20,3)4)22(24)25-15-17-9-8-12-19(14-17)26-18-10-6-5-7-11-18/h5-14,20-21H,15H2,1-4H3
52 atoms
O  0.548036 -2.75297 0.339213
O  -0.236153 -0.871169 1.257988
O  3.190672 2.282825 -0.366735
C  -3.008122 -2.292228 0.966158
C  -2.805539 -1.354226 -0.183805
C  -1.731825 -2.37489 0.151815
C  -3.957933 -3.457241 0.817757
C  -3.000523 -1.720988 2.363267
C  -3.538697 -1.463784 -1.457544
C  -0.427288 -1.893929 0.652506
C  -4.053517 -0.46224 -2.175263
C  -4.75913 -0.732412 -3.471026
C  -3.987244 0.98663 -1.797686
C  1.88682 -2.353013 0.640371
C  2.362875 -1.289425 -0.308302
C  2.57578 0.004338 0.144527
C  2.551094 -1.591773 -1.652843
C  2.951707 0.99867 -0.749491
C  2.948505 -0.599782 -2.533682
C  3.141004 0.699377 -2.091087
C  2.462809 2.879275 0.621205
C  3.127142 3.823917 1.391989
C  1.113639 2.621275 0.833852
C  2.438207 4.514505 2.375776
C  0.441963 3.310785 1.831771
C  1.094279 4.259155 2.604946
H  -2.540048 -0.347873 0.120107
H  -1.664794 -3.232709 -0.50811
H  -4.988225 -3.133205 0.974511
H  -3.733345 -4.225977 1.558977
H  -3.907753 -3.928271 -0.162905
H  -2.675842 -2.469592 3.088692
H  -4.012698 -1.416971 2.636418
H  -2.352039 -0.855129 2.464669
H  -3.657049 -2.468214 -1.85328
H  -4.26847 -0.214569 -4.299288
H  -5.789039 -0.367802 -3.443287
H  -4.786636 -1.794561 -3.711468
H  -3.514564 1.169079 -0.835854
H  -4.990247 1.417523 -1.756805
H  -3.436087 1.555836 -2.549901
H  2.474058 -3.264453 0.529026
H  1.968607 -2.020689 1.676998
H  2.418738 0.235813 1.189964
H  2.383796 -2.599928 -2.010918
H  3.099591 -0.833129 -3.579269
H  3.437797 1.482834 -2.775794
H  4.176985 4.014149 1.211358
H  0.586781 1.882702 0.244545
H  2.960451 5.25173 2.97126
H  -0.605411 3.09879 2.000754
H  0.560676 4.7936 3.379044
totalener: -1117.84803039 hartree
nucrepener: 2258.13377484 hartree
electener: -3375.98180523 hartree
oneelecener: -6005.17564407 hartree
twoeener: 2629.19383883 hartree
kineticenergy: 1112.86236187 hartree
xcener: -110.234730718297 hartree
chargesum: 0.0000000
charge: -0.267314 -0.409799 -0.299013 0.086884 0.043817 -0.085664 -0.249086 -0.254783 -0.183648 0.365648 -0.051801 -0.202666 -0.236762 0.056669 0.003682 -0.164080 -0.210886 0.262595 -0.072337 -0.225790 0.282401 -0.232459 -0.178782 -0.081670 -0.103868 -0.154962 0.082402 0.069436 0.093461 0.090008 0.071388 0.082496 0.084715 0.099841 0.069752 0.084397 0.083762 0.076012 0.081023 0.083988 0.089658 0.114314 0.101403 0.126313 0.111621 0.123741 0.123819 0.121100 0.130860 0.122962 0.122945 0.122260
qa: -0.2673 -0.4098 -0.2990 0.0869 0.0438 -0.0857 -0.2491 -0.2548 -0.1836 0.3656 -0.0518 -0.2027 -0.2368 0.0567 0.0037 -0.1641 -0.2109 0.2626 -0.0723 -0.2258 0.2824 -0.2325 -0.1788 -0.0817 -0.1039 -0.1550 0.0824 0.0694 0.0935 0.0900 0.0714 0.0825 0.0847 0.0998 0.0698 0.0844 0.0838 0.0760 0.0810 0.0840 0.0897 0.1143 0.1014 0.1263 0.1116 0.1237 0.1238 0.1211 0.1309 0.1230 0.1229 0.1223
va: 2.1324 2.0841 2.1183 3.7343 3.7906 3.8605 3.9187 3.9104 3.9049 4.1973 3.8262 3.9343 3.9460 3.8609 3.6633 3.9078 4.0280 3.8320 3.9192 4.0567 3.7881 4.0461 3.9393 3.9252 3.9443 3.9684 1.0344 1.0385 1.0035 1.0046 1.0106 1.0033 1.0002 1.0232 1.0223 0.9980 0.9984 1.0124 1.0156 0.9998 0.9984 0.9909 1.0112 1.0187 1.0147 0.9990 1.0138 1.0160 1.0114 0.9988 1.0007 1.0010
dispcorr: -0.023920075 hartree
energy: -1117.871950466149
dipole: -30.54919 30.01700 -0.53219 -7.80563 7.23866 -0.56697 -3.48225 3.26072 -0.22152
magnitude: 0.80855 au
magnitude: 2.05517 debye
