program: Orca
programVersion: 5.0.2
elementType: O O O C C C C C C C C C C C C C C C C C C C C C C C H H H H H H H H H H H H H H H H H H H H H H H H H H
charge: 0
multiplicity: 1
keywords: wb97x-d3
keywords: def2-TZVPP
keywords: def2/J RIJCOSX
keywords: DEFGRID2
keywords: scfconv7
keywords: smallprint printgap noloewdin
keywords: NOSOSCF
formula: C23H26O3
InChI: InChI=1/C23H26O3/c1-16(2)13-20-21(23(20,3)4)22(24)25-15-17-9-8-12-19(14-17)26-18-10-6-5-7-11-18/h5-14,20-21H,15H2,1-4H3
52 atoms
O  -0.309052 -1.641652 -1.753332
O  -0.942017 0.104941 -0.504783
O  3.907839 1.705016 0.64867
C  -2.185731 -2.348431 1.107125
C  -3.242851 -1.466377 0.528976
C  -2.135665 -1.966325 -0.364902
C  -2.511558 -3.795219 1.390821
C  -1.195373 -1.75851 2.081322
C  -4.639482 -1.938689 0.34367
C  -1.097546 -1.035121 -0.85463
C  -5.441676 -1.601121 -0.666629
C  -6.84985 -2.10801 -0.746986
C  -5.020488 -0.696958 -1.784553
C  0.854584 -0.93066 -2.162876
C  1.854419 -0.817318 -1.044766
C  2.409463 0.414569 -0.736518
C  2.217565 -1.942934 -0.312223
C  3.311477 0.528071 0.314308
C  3.125291 -1.822497 0.727128
C  3.670211 -0.590267 1.052339
C  3.240092 2.890417 0.546349
C  3.997078 4.000772 0.198408
C  1.884779 3.021956 0.826538
C  3.39537 5.247144 0.128617
C  1.295236 4.274106 0.741686
C  2.041554 5.390344 0.39356
H  -3.14215 -0.416519 0.794647
H  -2.383491 -2.768159 -1.051647
H  -1.603614 -4.400605 1.382107
H  -3.1995 -4.219642 0.659629
H  -2.968414 -3.902089 2.377093
H  -1.00419 -0.703078 1.901079
H  -0.238318 -2.282399 2.037327
H  -1.579574 -1.856015 3.098668
H  -5.038206 -2.585437 1.120437
H  -7.566126 -1.282798 -0.733529
H  -7.093023 -2.775773 0.078648
H  -7.01941 -2.650827 -1.680348
H  -5.078683 -1.213798 -2.746018
H  -4.007896 -0.31754 -1.66733
H  -5.691171 0.162851 -1.85602
H  0.594095 0.057551 -2.548507
H  1.258958 -1.51801 -2.98816
H  2.115735 1.289597 -1.302579
H  1.787011 -2.908282 -0.546061
H  3.407578 -2.695584 1.300633
H  4.369664 -0.48843 1.871483
H  5.051891 3.880481 -0.011042
H  1.286575 2.161648 1.098057
H  3.99025 6.109266 -0.142852
H  0.238918 4.372106 0.954042
H  1.572409 6.362751 0.331006
totalener: -1117.84636073 hartree
nucrepener: 2245.40238260 hartree
electener: -3363.24874334 hartree
oneelecener: -5979.66776774 hartree
twoeener: 2616.41902440 hartree
kineticenergy: 1112.85514113 hartree
xcener: -110.232560173284 hartree
chargesum: -0.0000000
charge: -0.265796 -0.379212 -0.298810 0.130506 -0.012816 -0.109601 -0.277204 -0.249268 -0.240157 0.320133 -0.008324 -0.211477 -0.224377 0.065250 0.069307 -0.186607 -0.270179 0.265374 -0.058237 -0.224981 0.276194 -0.228122 -0.185999 -0.084824 -0.113220 -0.151641 0.105236 0.085571 0.090309 0.085616 0.090511 0.093654 0.080820 0.088640 0.092597 0.087319 0.078521 0.083803 0.085610 0.082498 0.089690 0.099450 0.109917 0.117452 0.117885 0.124651 0.123996 0.122062 0.143058 0.123743 0.128169 0.123313
qa: -0.2658 -0.3792 -0.2988 0.1305 -0.0128 -0.1096 -0.2772 -0.2493 -0.2402 0.3201 -0.0083 -0.2115 -0.2244 0.0652 0.0693 -0.1866 -0.2702 0.2654 -0.0582 -0.2250 0.2762 -0.2281 -0.1860 -0.0848 -0.1132 -0.1516 0.1052 0.0856 0.0903 0.0856 0.0905 0.0937 0.0808 0.0886 0.0926 0.0873 0.0785 0.0838 0.0856 0.0825 0.0897 0.0994 0.1099 0.1175 0.1179 0.1247 0.1240 0.1221 0.1431 0.1237 0.1282 0.1233
va: 2.1167 2.1195 2.1150 3.7520 3.8245 3.8021 3.9058 3.8975 3.9000 4.2384 3.7358 3.9420 3.9390 3.8594 3.6369 3.9535 3.9985 3.8356 3.8892 4.0555 3.7820 4.0461 3.9411 3.9263 3.9478 3.9636 1.0260 1.0312 1.0065 1.0050 1.0013 1.0182 1.0067 1.0040 1.0094 0.9987 1.0097 0.9992 1.0008 1.0197 1.0020 1.0117 0.9891 1.0144 1.0189 0.9983 1.0135 1.0156 1.0017 0.9989 0.9995 1.0008
dispcorr: -0.025334271 hartree
energy: -1117.871695005744
dipole: -29.78870 29.32063 -0.46807 -13.64144 13.07402 -0.56742 1.84435 -2.09377 -0.24942
magnitude: 0.77670 au
magnitude: 1.97422 debye
