program: Orca
programVersion: 5.0.2
elementType: O O O C C C C C C C C C C C C C C C C C C C C C C C H H H H H H H H H H H H H H H H H H H H H H H H H H
charge: 0
multiplicity: 1
keywords: wb97x-d3
keywords: def2-TZVPP
keywords: def2/J RIJCOSX
keywords: DEFGRID2
keywords: scfconv7
keywords: smallprint printgap noloewdin
keywords: NOSOSCF
formula: C23H26O3
InChI: InChI=1/C23H26O3/c1-16(2)13-20-21(23(20,3)4)22(24)25-15-17-9-8-12-19(14-17)26-18-10-6-5-7-11-18/h5-14,20-21H,15H2,1-4H3
52 atoms
O  0.53896 -2.719993 0.068182
O  -0.194157 -0.851573 1.055195
O  3.581759 2.094621 0.125225
C  -2.990167 -2.153775 0.501041
C  -2.706564 -1.068824 -0.492422
C  -1.685637 -2.157349 -0.278624
C  -3.977836 -3.231207 0.124893
C  -3.011189 -1.812359 1.970685
C  -3.416815 -0.966502 -1.791476
C  -0.397019 -1.812246 0.359119
C  -4.503513 -0.223449 -2.004507
C  -5.140761 -0.137053 -3.357897
C  -5.166286 0.584923 -0.930929
C  1.857093 -2.484678 0.56934
C  2.562134 -1.409264 -0.207761
C  2.756227 -0.1566 0.355306
C  2.994058 -1.655947 -1.5074
C  3.355713 0.852637 -0.386824
C  3.612322 -0.650916 -2.232615
C  3.786946 0.609608 -1.682144
C  2.631125 2.723514 0.875968
C  1.267097 2.518396 0.706473
C  3.09246 3.640709 1.811327
C  0.373445 3.231153 1.491131
C  2.185917 4.354049 2.578157
C  0.821916 4.15038 2.427053
H  -2.422827 -0.121012 -0.043163
H  -1.616442 -2.919301 -1.047904
H  -3.930902 -3.492527 -0.931532
H  -4.997655 -2.900964 0.331198
H  -3.797047 -4.138356 0.703925
H  -2.722997 -2.673345 2.576378
H  -4.023854 -1.531274 2.26537
H  -2.349416 -0.988837 2.224777
H  -3.002181 -1.525218 -2.625705
H  -5.147814 0.893167 -3.722609
H  -6.183501 -0.462217 -3.324117
H  -4.621554 -0.748334 -4.095028
H  -6.223162 0.320499 -0.846758
H  -5.132759 1.6512 -1.168856
H  -4.712263 0.445328 0.048181
H  2.365969 -3.44166 0.454488
H  1.826134 -2.242548 1.633243
H  2.411964 0.036762 1.362862
H  2.847132 -2.632783 -1.951276
H  3.952903 -0.842876 -3.241457
H  4.255961 1.404099 -2.247348
H  0.894432 1.803303 -0.014126
H  4.157715 3.790447 1.92853
H  -0.686856 3.05907 1.362703
H  2.551454 5.06741 3.304966
H  0.116157 4.700892 3.034155
totalener: -1117.84720236 hartree
nucrepener: 2253.32706010 hartree
electener: -3371.17426246 hartree
oneelecener: -5995.61798992 hartree
twoeener: 2624.44372745 hartree
kineticenergy: 1112.86846329 hartree
xcener: -110.234010639914 hartree
chargesum: -0.0000000
charge: -0.265355 -0.408465 -0.300548 0.113625 -0.044793 -0.098460 -0.239727 -0.277325 -0.187100 0.367832 -0.028150 -0.212378 -0.235764 0.050893 0.003161 -0.151999 -0.200626 0.239842 -0.079992 -0.214635 0.275529 -0.163643 -0.231627 -0.103581 -0.082633 -0.155660 0.106393 0.075625 0.079874 0.086594 0.093000 0.088727 0.082584 0.104122 0.088930 0.086574 0.083862 0.079013 0.084346 0.094267 0.080265 0.114351 0.103922 0.129065 0.110921 0.124145 0.124572 0.125953 0.120893 0.120527 0.121780 0.121277
qa: -0.2654 -0.4085 -0.3005 0.1136 -0.0448 -0.0985 -0.2397 -0.2773 -0.1871 0.3678 -0.0281 -0.2124 -0.2358 0.0509 0.0032 -0.1520 -0.2006 0.2398 -0.0800 -0.2146 0.2755 -0.1636 -0.2316 -0.1036 -0.0826 -0.1557 0.1064 0.0756 0.0799 0.0866 0.0930 0.0887 0.0826 0.1041 0.0889 0.0866 0.0839 0.0790 0.0843 0.0943 0.0803 0.1144 0.1039 0.1291 0.1109 0.1241 0.1246 0.1260 0.1209 0.1205 0.1218 0.1213
va: 2.1360 2.0822 2.1149 3.7058 3.8158 3.8926 3.9068 3.9071 3.8559 4.2066 3.7372 3.9409 3.9431 3.8639 3.6423 3.9046 4.0240 3.8458 3.9220 4.0582 3.7967 3.9287 4.0414 3.9535 3.9296 3.9689 1.0200 1.0366 1.0077 1.0047 1.0050 1.0028 1.0021 1.0209 1.0146 0.9977 0.9988 1.0108 1.0009 1.0005 1.0109 0.9915 1.0098 1.0205 1.0135 0.9991 1.0127 1.0134 1.0158 1.0010 0.9991 1.0012
dispcorr: -0.024691138 hartree
energy: -1117.871893500900
dipole: -34.30930 33.61574 -0.69356 -7.17301 6.56827 -0.60474 -3.94825 3.65757 -0.29068
magnitude: 0.96500 au
magnitude: 2.45284 debye
