program: Gaussian 09
title: 000071911
version: EM64L-G09RevD.01
frameworkgroup: C1[X(C17H27NO)]
method: RPBEPBE
basis: SDD
operation: Freq
keyword: #p
keyword: freq=noraman
keyword: PBEPBE/SDD
title: #p freq=noraman PBEPBE/SDD
converged: YES YES NO NO
title: Mulliken charges:
elementType: O N C C C C C C C C C C C C C C C C C H H H H H H H H H H H H H H H H H H H H H H H H H H H
charge: -0.280493 -0.074467 -0.370690 -0.351383 -0.448019 -0.445159 -0.425732 -0.129055 0.432350 -0.280409 -0.422956 -0.028666 -0.438167 -0.373945 -0.710716 -0.712934 -0.219465 -0.232165 -0.244171 0.210685 0.180534 0.171575 0.231491 0.214154 0.223711 0.229747 0.203105 0.198287 0.234438 0.192094 0.200755 0.208690 0.207533 0.214309 0.201400 0.231045 0.260083 0.214554 0.209544 0.209657 0.210155 0.207538 0.216429 0.223591 0.224158 0.226979
chargesum: 0.00000
title: Mulliken charges with hydrogens summed into heavy atoms:
elementType: O N C C C C C C C C C C C C C C C C C
charge: -0.280493 -0.074467 0.020530 0.051683 -0.010154 -0.012307 0.006993 0.063039 0.432350 0.129035 -0.001114 0.172734 -0.207122 -0.113861 -0.076961 -0.078812 0.004126 -0.008007 -0.017192
polarizability: 1.91946306e+02 -2.21572713e+01 2.07529027e+02 1.22195015e+01 6.14114679e+00 1.68020229e+02
1716.lowfreq: -20.4122 -9.3880 -4.9716 -0.0006 -0.0001 0.0005 5.1634 17.3280 27.1774
frequency: -18.4825 16.3428 27.0868 31.6372 35.4549 43.5107 56.0700 84.8829 102.5151 109.9911 138.1727 167.6704 211.3594 217.6683 236.1434 242.3702 248.2873 272.4734 315.8328 344.8601 357.9051 367.9951 405.5242 442.8659 481.7086 519.8100 563.8439 591.4714 615.6268 620.3936 652.4350 708.7197 761.1944 773.2674 784.6382 790.1654 819.8277 842.9332 853.0955 859.3717 870.6054 899.8669 910.7199 924.4191 952.0120 954.9241 961.0347 968.0898 981.0298 983.2205 989.4848 992.6436 997.6762 1017.2710 1024.4758 1044.7346 1055.2965 1064.3652 1080.3156 1096.3968 1131.4529 1142.2068 1148.0008 1151.0679 1170.4169 1181.2048 1184.5316 1192.6037 1194.4900 1199.5302 1210.8044 1217.5168 1240.4620 1255.6170 1261.9841 1280.3213 1285.5292 1288.8498 1296.1483 1305.5344 1320.3529 1331.7424 1332.1824 1342.6259 1347.0603 1372.4487 1374.4674 1382.9263 1391.4236 1392.7509 1438.5345 1445.4260 1463.3090 1465.1017 1465.4084 1475.4648 1479.0063 1479.0693 1480.8305 1484.3077 1487.0179 1491.3284 1498.4622 1593.1737 1612.1853 2825.0296 2836.6652 2857.0316 2931.2283 2937.3319 2961.1324 2967.4049 2971.9041 2985.3456 2987.8685 3009.0130 3013.7870 3022.8675 3038.3743 3043.4886 3045.7743 3060.2768 3066.2357 3066.9738 3068.7607 3069.7412 3091.1216 3108.8947 3122.2576 3134.2237 3145.9385 3160.7581
redmass: 2.5469 4.0360 3.7211 2.6140 3.5331 2.0324 3.1634 2.9646 1.9151 3.3516 3.1641 3.6780 1.5904 1.7682 1.1202 3.0919 3.3986 4.1983 3.0740 2.0299 2.0724 2.3275 2.8455 3.9049 3.0707 3.4375 2.7201 3.3259 6.0805 2.8956 4.6834 1.7138 1.6698 1.7595 2.4127 1.2841 2.4142 2.4440 2.8077 1.2582 2.1520 2.5860 1.1878 1.4443 1.3089 2.1039 1.7267 1.9910 1.3798 2.4107 6.0104 1.7084 1.3246 2.1392 2.2136 3.8070 3.1639 2.3644 1.6474 1.5281 2.3719 2.2343 2.0110 1.7584 1.0591 1.1356 1.3092 1.8870 1.4845 1.9430 1.2723 1.8147 1.2673 1.3392 1.3311 1.1332 1.4459 1.3114 1.3507 1.2820 1.3699 1.3397 1.4396 1.3872 1.3967 1.4005 1.2107 3.6762 1.3225 1.5638 2.0639 1.1180 1.0859 1.0772 1.0464 1.0552 1.0942 2.2107 1.0895 1.0590 1.0568 1.0766 1.1014 6.1123 6.0947 1.0715 1.0724 1.0695 1.0702 1.0677 1.0802 1.0366 1.0358 1.0999 1.0659 1.0683 1.0750 1.0676 1.0886 1.0869 1.1033 1.0998 1.1000 1.1041 1.0985 1.0991 1.1055 1.0872 1.0859 1.0912 1.0954 1.1013
irintensity: 0.0209 0.2548 0.1208 0.3855 0.1615 0.1116 0.5732 0.2784 1.2912 0.0849 1.2495 0.6035 2.5601 1.1990 0.2578 2.5771 1.6582 4.3358 6.2882 1.6589 0.1024 0.4303 0.2039 1.1209 6.5788 21.1938 1.1095 15.0800 0.6699 4.0280 2.9175 58.8214 20.1140 12.0769 1.3587 2.0802 5.3987 4.7574 12.2295 0.2969 13.9417 6.3136 2.5192 2.8184 0.2050 1.5706 14.7875 2.5260 0.0905 48.5786 0.2573 0.7215 3.7927 11.6125 11.8252 117.1847 12.4402 11.6862 7.2253 0.5631 12.0694 24.7389 30.7599 15.0750 0.0941 1.0145 2.3800 6.3309 5.6333 5.0309 0.7556 20.4068 6.0705 3.2881 1.7355 1.1305 3.0461 10.0410 4.5987 22.2345 4.9831 13.1362 5.3063 3.8122 8.6370 2.4677 21.1894 5.5352 10.2786 5.1259 11.0084 13.5842 4.6850 4.3497 2.2300 2.1396 9.5659 14.7649 0.2542 21.3521 12.8488 4.8388 3.4893 1.1724 4.6832 78.4821 83.6207 175.2150 25.9848 51.7504 20.4989 28.1536 28.4076 44.2215 35.2692 15.8845 64.6226 61.7246 11.3976 37.8565 42.0590 8.2654 26.2091 9.0898 114.4813 67.1286 73.8165 10.6235 0.0963 18.1756 32.4477 27.2962
temp: 298.150 k
press: 1.00000 atm
elementType: 8 7 6 6 6 6 6 6 6 6 6 6 6 6 6 6 6 6 6 1 1 1 1 1 1 1 1 1 1 1 1 1 1 1 1 1 1 1 1 1 1 1 1 1 1 1
symmnumber: 1
zpe: 1060477.6 jmol-1
zpe.correction: 0.403915 hartree
zpe.thermalcorrener: 0.423718 hartree
zpe.thermalcorrenthalpy: 0.424663 hartree
zpe.thermalcorrgfe: 0.351996 hartree
zpe.sumelectzpe: -792.463920 hartree
zpe.sumelectthermal: -792.444116 hartree
zpe.sumelectthermalent: -792.443172 hartree
zpe.sumelectthermalfe: -792.515839 hartree
dipole: 0.3277 0.4284 0.9092
dipole: 1.0571
quadrupole: -110.1903 -113.7196 -113.3270
quadrupole: -0.5593 2.7006 0.6798
quadrupole: 2.2220 -1.3073 -0.9147 -0.5593 2.7006 0.6798
hfenergy: -792.8678345 hartree
pointgroup: C01 [X(C17H27N1O1)]
dipole: -0.0820142 0.1750893 -0.3682356 debye
polarizability: 199.1291728|24.2486697|198.7877807|11.3726259|-8.3019596|169.5786085 unknown
InChI: InChI=1S/C17H27NO/c1-15(2)10-13-19-17(14-18-11-6-7-12-18)16-8-4-3-5-9-16/h3-5,8-9,15,17H,6-7,10-14H2,1-2H3
charge 0 multiplicity 1
46 atoms
O  0.238031 -0.667307 0.661929
N  -2.750893 -0.148068 0.099654
C  -3.352679 0.132661 -1.229334
C  -3.88907 -0.285487 1.040606
C  -4.689202 -0.671279 -1.241571
C  -4.888663 -1.144478 0.236273
C  -1.685414 0.776009 0.512692
C  -0.316919 0.438034 -0.131879
C  0.616792 1.650408 -0.151778
C  1.331791 -1.383329 -0.016639
C  1.76302 -2.517539 0.921685
C  2.918821 -3.412217 0.389725
C  0.680198 2.489404 -1.291446
C  1.393795 1.97961 0.987137
C  4.241943 -2.626676 0.211247
C  2.538181 -4.160084 -0.912348
C  1.498906 3.641806 -1.294277
C  2.21498 3.128925 0.986754
C  2.268627 3.965789 -0.152926
H  -2.669637 -0.16872 -2.044753
H  -3.559662 1.227973 -1.355509
H  -4.350038 0.703842 1.299727
H  -3.557937 -0.764453 1.978961
H  -5.522634 -0.028494 -1.575905
H  -4.640146 -1.533578 -1.927822
H  -4.617988 -2.209854 0.333652
H  -5.927416 -1.017665 0.588297
H  -1.943851 1.83906 0.272523
H  -1.548225 0.707203 1.607866
H  -0.488082 0.095375 -1.177314
H  0.95925 -1.780343 -0.985812
H  2.1699 -0.684859 -0.223458
H  2.064637 -2.06688 1.887855
H  0.874135 -3.145836 1.125892
H  3.094063 -4.18102 1.17193
H  0.089992 2.238118 -2.182589
H  1.355943 1.316946 1.859348
H  4.516256 -2.088687 1.138177
H  5.072942 -3.310454 -0.044332
H  4.164074 -1.880678 -0.601966
H  3.318942 -4.894508 -1.18501
H  2.429041 -3.461474 -1.763207
H  1.582713 -4.705321 -0.796012
H  1.54158 4.281024 -2.183734
H  2.814163 3.372176 1.871913
H  2.90704 4.856627 -0.153821
