program: Orca
programVersion: 5.0.2
elementType: O O O C C C C C C C C C C C C C C C C C C C C C C C H H H H H H H H H H H H H H H H H H H H H H H H H H
charge: 0
multiplicity: 1
keywords: wb97x-d3
keywords: def2-TZVPP
keywords: def2/J RIJCOSX
keywords: DEFGRID2
keywords: scfconv7
keywords: smallprint printgap noloewdin
keywords: NOSOSCF
formula: C23H26O3
InChI: InChI=1/C23H26O3/c1-16(2)13-20-21(23(20,3)4)22(24)25-15-17-9-8-12-19(14-17)26-18-10-6-5-7-11-18/h5-14,20-21H,15H2,1-4H3
52 atoms
O  0.264067 -2.354942 0.858346
O  0.190724 -3.251191 -1.186929
O  2.723104 2.198499 0.224145
C  -2.775984 -2.113656 0.731631
C  -2.156458 -0.844757 0.242011
C  -1.742412 -2.166184 -0.376457
C  -4.183868 -2.438337 0.286591
C  -2.479206 -2.605823 2.127204
C  -2.929627 0.154408 -0.537561
C  -0.352087 -2.662497 -0.290351
C  -2.60085 0.678195 -1.720588
C  -3.476893 1.703131 -2.377092
C  -1.367152 0.320802 -2.493885
C  1.678406 -2.542331 0.898609
C  2.371763 -1.45159 0.131858
C  2.223547 -0.135331 0.555717
C  3.120403 -1.730139 -1.002806
C  2.811447 0.894974 -0.162697
C  3.729047 -0.696085 -1.698742
C  3.570895 0.617798 -1.291932
C  1.558289 2.695826 0.731207
C  0.308383 2.319183 0.252717
C  1.667526 3.657547 1.726028
C  -0.828667 2.910479 0.781264
C  0.522547 4.246912 2.238757
C  -0.729914 3.874218 1.774091
H  -1.42208 -0.414808 0.920184
H  -2.155002 -2.369991 -1.357943
H  -4.392491 -2.079976 -0.72128
H  -4.915219 -1.982937 0.957545
H  -4.350155 -3.51666 0.29964
H  -3.236609 -2.225908 2.815344
H  -1.509626 -2.287595 2.498412
H  -2.516029 -3.69589 2.171686
H  -3.844623 0.50458 -0.06574
H  -2.936784 2.64211 -2.521793
H  -4.371651 1.916207 -1.793346
H  -3.793529 1.37095 -3.368817
H  -0.825076 1.223868 -2.784365
H  -1.628556 -0.190555 -3.423951
H  -0.678627 -0.319263 -1.94862
H  1.955863 -3.528051 0.522721
H  1.93414 -2.497049 1.957515
H  1.643875 0.084352 1.444674
H  3.213755 -2.750524 -1.349274
H  4.31441 -0.912225 -2.582349
H  4.029946 1.430369 -1.839252
H  0.214235 1.57455 -0.526702
H  2.647604 3.941392 2.086402
H  -1.795942 2.606568 0.402961
H  0.613332 4.997755 3.012558
H  -1.621639 4.332271 2.179738
totalener: -1117.84328656 hartree
nucrepener: 2372.04035865 hartree
electener: -3489.88364521 hartree
oneelecener: -6232.58181141 hartree
twoeener: 2742.69816620 hartree
kineticenergy: 1112.86741295 hartree
xcener: -110.236753179356 hartree
chargesum: -0.0000000
charge: -0.271779 -0.360699 -0.300782 0.111233 0.017599 -0.079833 -0.271761 -0.254591 -0.296173 0.293080 -0.004866 -0.214708 -0.250205 0.040120 0.019527 -0.234693 -0.131954 0.259441 -0.084709 -0.216013 0.253098 -0.165182 -0.207610 -0.124212 -0.087728 -0.161840 0.088196 0.101530 0.086851 0.087436 0.094856 0.081525 0.088946 0.090765 0.100000 0.090012 0.080055 0.092940 0.096443 0.110721 0.096119 0.105857 0.104069 0.121159 0.113021 0.125107 0.124542 0.135233 0.124055 0.140085 0.123652 0.122068
qa: -0.2718 -0.3607 -0.3008 0.1112 0.0176 -0.0798 -0.2718 -0.2546 -0.2962 0.2931 -0.0049 -0.2147 -0.2502 0.0401 0.0195 -0.2347 -0.1320 0.2594 -0.0847 -0.2160 0.2531 -0.1652 -0.2076 -0.1242 -0.0877 -0.1618 0.0882 0.1015 0.0869 0.0874 0.0949 0.0815 0.0889 0.0908 0.1000 0.0900 0.0801 0.0929 0.0964 0.1107 0.0961 0.1059 0.1041 0.1212 0.1130 0.1251 0.1245 0.1352 0.1241 0.1401 0.1237 0.1221
va: 2.0854 2.1427 2.1196 3.7859 3.7404 3.8123 3.9173 3.9019 3.8286 4.2576 3.7137 3.9297 3.9406 3.8899 3.6721 3.9429 3.9887 3.8155 3.9361 4.0429 3.8561 3.9139 4.0227 3.9172 3.9329 4.0057 1.0205 1.0191 1.0058 1.0031 1.0051 1.0028 1.0191 1.0023 1.0129 0.9993 1.0094 1.0009 0.9972 1.0020 1.0012 1.0109 0.9964 1.0174 1.0183 0.9991 1.0129 0.9905 1.0147 1.0027 0.9986 1.0023
dispcorr: -0.029761714 hartree
energy: -1117.873048272699
dipole: -23.83961 23.30723 -0.53238 -2.03697 2.35939 0.32242 -2.94108 3.35687 0.41579
magnitude: 0.74851 au
magnitude: 1.90257 debye
