program: Orca
programVersion: 5.0.2
elementType: O O O C C C C C C C C C C C C C C C C C C C C C C C H H H H H H H H H H H H H H H H H H H H H H H H H H
charge: 0
multiplicity: 1
keywords: wb97x-d3
keywords: def2-TZVPP
keywords: def2/J RIJCOSX
keywords: DEFGRID2
keywords: scfconv7
keywords: smallprint printgap noloewdin
keywords: NOSOSCF
formula: C23H26O3
InChI: InChI=1/C23H26O3/c1-16(2)13-20-21(23(20,3)4)22(24)25-15-17-9-8-12-19(14-17)26-18-10-6-5-7-11-18/h5-14,20-21H,15H2,1-4H3
52 atoms
O  0.307286 -2.28828 0.98196
O  0.160971 -3.280973 -1.013997
O  2.716513 2.216412 -0.015625
C  -2.726231 -2.061941 0.988691
C  -2.163154 -0.829076 0.359449
C  -1.755553 -2.19173 -0.16913
C  -4.149421 -2.451183 0.660206
C  -2.339092 -2.420066 2.403054
C  -2.9997 0.090087 -0.452721
C  -0.352514 -2.658168 -0.123784
C  -2.741503 0.536782 -1.683954
C  -3.676798 1.489624 -2.367503
C  -1.53492 0.158156 -2.488771
C  1.720721 -2.480673 0.984192
C  2.399114 -1.435555 0.144348
C  2.229129 -0.094584 0.473026
C  3.167719 -1.783931 -0.956625
C  2.817602 0.889622 -0.306902
C  3.774943 -0.793743 -1.715174
C  3.597061 0.542945 -1.403413
C  1.560527 2.737083 0.487557
C  1.685587 3.743496 1.434887
C  0.303709 2.341719 0.044414
C  0.549387 4.361876 1.932661
C  -0.824683 2.96277 0.55746
C  -0.70965 3.973853 1.50025
H  -1.402458 -0.333263 0.958739
H  -2.218685 -2.479025 -1.10613
H  -4.290617 -3.525656 0.787844
H  -4.426002 -2.197825 -0.362872
H  -4.850925 -1.945785 1.326706
H  -2.321212 -3.502493 2.542109
H  -3.079754 -2.014647 3.094857
H  -1.369556 -2.027404 2.693708
H  -3.901524 0.450032 0.036953
H  -3.169556 2.425224 -2.615686
H  -4.543262 1.729784 -1.752435
H  -4.03922 1.073879 -3.310822
H  -0.828259 -0.467971 -1.950908
H  -1.003758 1.053249 -2.821789
H  -1.827981 -0.376293 -3.396011
H  1.981571 -3.485642 0.64849
H  2.010922 -2.3863 2.030813
H  1.634245 0.179195 1.33641
H  3.279419 -2.82504 -1.228636
H  4.376384 -1.064073 -2.572682
H  4.056277 1.320861 -1.998909
H  2.671088 4.039767 1.769298
H  0.198295 1.55925 -0.695708
H  0.652456 5.148093 2.668793
H  -1.797987 2.645253 0.206923
H  -1.594425 4.456194 1.892615
totalener: -1117.84348344 hartree
nucrepener: 2367.30679510 hartree
electener: -3485.15027854 hartree
oneelecener: -6223.11527145 hartree
twoeener: 2737.96499291 hartree
kineticenergy: 1112.86580313 hartree
xcener: -110.236149606196 hartree
chargesum: -0.0000000
charge: -0.272017 -0.359701 -0.300522 0.118761 0.014145 -0.086812 -0.272556 -0.254092 -0.287751 0.295592 -0.008128 -0.214126 -0.257062 0.040366 0.027608 -0.239193 -0.139039 0.263537 -0.080294 -0.221750 0.265844 -0.211981 -0.187486 -0.084659 -0.115846 -0.163183 0.088278 0.102420 0.094607 0.086358 0.087472 0.090956 0.081208 0.088167 0.098208 0.089545 0.080473 0.092965 0.101608 0.094215 0.109481 0.105008 0.104058 0.122078 0.111186 0.124913 0.124733 0.123923 0.143806 0.123531 0.138711 0.122435
qa: -0.2720 -0.3597 -0.3005 0.1188 0.0141 -0.0868 -0.2726 -0.2541 -0.2878 0.2956 -0.0081 -0.2141 -0.2571 0.0404 0.0276 -0.2392 -0.1390 0.2635 -0.0803 -0.2218 0.2658 -0.2120 -0.1875 -0.0847 -0.1158 -0.1632 0.0883 0.1024 0.0946 0.0864 0.0875 0.0910 0.0812 0.0882 0.0982 0.0895 0.0805 0.0930 0.1016 0.0942 0.1095 0.1050 0.1041 0.1221 0.1112 0.1249 0.1247 0.1239 0.1438 0.1235 0.1387 0.1224
va: 2.0856 2.1441 2.1203 3.7746 3.7490 3.8140 3.9187 3.9039 3.8293 4.2560 3.7144 3.9295 3.9423 3.8905 3.6782 3.9403 3.9970 3.8130 3.9319 4.0459 3.8435 4.0293 3.9320 3.9279 3.9127 4.0059 1.0187 1.0192 1.0049 1.0061 1.0029 1.0026 1.0028 1.0187 1.0131 0.9993 1.0094 1.0009 1.0020 0.9964 1.0027 1.0111 0.9956 1.0178 1.0170 0.9991 1.0132 1.0148 0.9859 0.9986 1.0028 1.0022
dispcorr: -0.029511094 hartree
energy: -1117.872994534720
dipole: -24.08579 23.56343 -0.52235 -2.39833 2.73970 0.34137 -1.77875 2.22127 0.44252
magnitude: 0.76499 au
magnitude: 1.94445 debye
