program: Orca
programVersion: 5.0.2
elementType: O O O C C C C C C C C C C C C C C C C C C C C C C C H H H H H H H H H H H H H H H H H H H H H H H H H H
charge: 0
multiplicity: 1
keywords: wb97x-d3
keywords: def2-TZVPP
keywords: def2/J RIJCOSX
keywords: DEFGRID2
keywords: scfconv7
keywords: smallprint printgap noloewdin
keywords: NOSOSCF
formula: C23H26O3
InChI: InChI=1/C23H26O3/c1-16(2)13-20-21(23(20,3)4)22(24)25-15-17-9-8-12-19(14-17)26-18-10-6-5-7-11-18/h5-14,20-21H,15H2,1-4H3
52 atoms
O  0.390643 -2.420033 0.52648
O  -0.525585 -0.428321 0.970692
O  3.618213 2.359699 -0.64936
C  -3.201988 -2.062313 0.870852
C  -2.991713 -1.374642 -0.441686
C  -1.881868 -2.2178 0.135161
C  -4.070305 -3.296693 0.909085
C  -3.292955 -1.230814 2.126664
C  -3.659322 -1.809502 -1.696182
C  -0.63689 -1.563791 0.591407
C  -4.93269 -1.564896 -2.00621
C  -5.521865 -2.017673 -3.307317
C  -5.866936 -0.819152 -1.103302
C  1.678564 -1.907377 0.855316
C  2.223054 -1.008674 -0.219965
C  2.636491 0.276933 0.097778
C  2.327364 -1.468326 -1.527795
C  3.157492 1.102544 -0.890977
C  2.847757 -0.637634 -2.507026
C  3.262095 0.647188 -2.19829
C  3.183256 3.066235 0.435832
C  4.144339 3.647264 1.248978
C  1.830923 3.253796 0.69395
C  3.749252 4.430309 2.323284
C  1.449996 4.029577 1.777048
C  2.403151 4.62146 2.594218
H  -2.806455 -0.306127 -0.360561
H  -1.730305 -3.189878 -0.321814
H  -3.953953 -3.916754 0.021576
H  -5.124547 -3.020395 0.976563
H  -3.830092 -3.906729 1.78163
H  -4.338178 -0.985035 2.326253
H  -2.737618 -0.299118 2.059761
H  -2.918672 -1.783163 2.990717
H  -3.046688 -2.347174 -2.414122
H  -6.381092 -2.672609 -3.142667
H  -4.799598 -2.558458 -3.917292
H  -5.885554 -1.168926 -3.891548
H  -6.746577 -1.423607 -0.868362
H  -6.235931 0.085479 -1.59304
H  -5.402033 -0.523721 -0.164747
H  2.304155 -2.794061 0.964083
H  1.65717 -1.391041 1.817351
H  2.53532 0.630537 1.115784
H  2.001713 -2.469023 -1.781779
H  2.93056 -0.990686 -3.526436
H  3.666537 1.300322 -2.960109
H  5.192561 3.489446 1.0318
H  1.082311 2.793227 0.06204
H  4.500802 4.886233 2.954204
H  0.397029 4.173083 1.979528
H  2.097567 5.228284 3.4357
totalener: -1117.84679107 hartree
nucrepener: 2212.96284457 hartree
electener: -3330.80963564 hartree
oneelecener: -5914.91347388 hartree
twoeener: 2584.10383824 hartree
kineticenergy: 1112.86761934 hartree
xcener: -110.233574107486 hartree
chargesum: -0.0000000
charge: -0.271343 -0.392961 -0.298008 0.063965 -0.032532 -0.080014 -0.246377 -0.263272 -0.186777 0.352382 -0.022873 -0.210426 -0.246627 0.061004 0.009179 -0.138016 -0.229571 0.250778 -0.069117 -0.225626 0.249881 -0.205914 -0.173187 -0.096679 -0.106538 -0.143157 0.109087 0.078694 0.083022 0.084609 0.095722 0.079564 0.102535 0.089479 0.088685 0.083921 0.079282 0.086695 0.088000 0.098196 0.084037 0.111197 0.097195 0.114480 0.113943 0.122738 0.123434 0.123380 0.137200 0.124432 0.127483 0.124816
qa: -0.2713 -0.3930 -0.2980 0.0640 -0.0325 -0.0800 -0.2464 -0.2633 -0.1868 0.3524 -0.0229 -0.2104 -0.2466 0.0610 0.0092 -0.1380 -0.2296 0.2508 -0.0691 -0.2256 0.2499 -0.2059 -0.1732 -0.0967 -0.1065 -0.1432 0.1091 0.0787 0.0830 0.0846 0.0957 0.0796 0.1025 0.0895 0.0887 0.0839 0.0793 0.0867 0.0880 0.0982 0.0840 0.1112 0.0972 0.1145 0.1139 0.1227 0.1234 0.1234 0.1372 0.1244 0.1275 0.1248
va: 2.1241 2.1104 2.1125 3.7368 3.8222 3.8299 3.9084 3.9056 3.8615 4.2280 3.7349 3.9379 3.9356 3.8686 3.7261 3.8973 4.0193 3.8467 3.9243 4.0432 3.8018 4.0466 3.9669 3.9301 3.9392 3.9559 1.0245 1.0352 1.0072 1.0017 1.0060 1.0017 1.0232 1.0029 1.0133 0.9989 1.0106 0.9983 0.9984 1.0038 1.0102 0.9879 1.0130 1.0190 1.0169 0.9990 1.0142 1.0138 1.0054 0.9993 0.9995 1.0004
dispcorr: -0.024225789 hartree
energy: -1117.871016857226
dipole: -35.46851 34.86808 -0.60043 -12.63887 12.08631 -0.55255 -1.13261 1.19091 0.05830
magnitude: 0.81807 au
magnitude: 2.07936 debye
