program: Orca
programVersion: 5.0.2
elementType: O O O C C C C C C C C C C C C C C C C C C C C C C C H H H H H H H H H H H H H H H H H H H H H H H H H H
charge: 0
multiplicity: 1
keywords: wb97x-d3
keywords: def2-TZVPP
keywords: def2/J RIJCOSX
keywords: DEFGRID2
keywords: scfconv7
keywords: smallprint printgap noloewdin
keywords: NOSOSCF
formula: C23H26O3
InChI: InChI=1/C23H26O3/c1-16(2)13-20-21(23(20,3)4)22(24)25-15-17-9-8-12-19(14-17)26-18-10-6-5-7-11-18/h5-14,20-21H,15H2,1-4H3
52 atoms
O  0.078734 -2.138181 1.38243
O  -0.347256 -2.710234 -0.737688
O  1.977004 2.515107 0.52598
C  -2.884552 -0.93358 -0.108244
C  -3.25224 -2.383921 -0.229771
C  -2.128098 -1.986877 0.685786
C  -3.776852 -0.021807 0.695995
C  -2.227178 -0.246936 -1.280773
C  -4.501057 -2.943216 0.344921
C  -0.734624 -2.328612 0.333771
C  -5.644967 -3.100215 -0.322493
C  -6.845982 -3.723573 0.321214
C  -5.82534 -2.687736 -1.751636
C  1.474172 -2.264392 1.12962
C  2.001564 -1.105352 0.329496
C  1.794699 0.192368 0.784272
C  2.699205 -1.312636 -0.851305
C  2.278025 1.269492 0.059063
C  3.194878 -0.229915 -1.562542
C  2.986879 1.065573 -1.119722
C  2.892738 3.521969 0.441847
C  4.235508 3.331467 0.746659
C  2.422912 4.780229 0.093078
C  5.102679 4.411783 0.697848
C  3.300045 5.85276 0.056098
C  4.642828 5.674734 0.35396
H  -2.916005 -2.849557 -1.152063
H  -2.336755 -1.987729 1.75088
H  -3.21539 0.840949 1.05904
H  -4.219391 -0.5218 1.556807
H  -4.59787 0.349154 0.079541
H  -1.660592 -0.929433 -1.909022
H  -1.546535 0.538165 -0.945634
H  -2.990138 0.224235 -1.90324
H  -4.463554 -3.264765 1.382075
H  -7.137909 -4.638982 -0.19928
H  -7.708526 -3.054313 0.280016
H  -6.666125 -3.977211 1.365123
H  -6.670724 -2.002256 -1.84995
H  -6.052863 -3.551364 -2.382013
H  -4.948783 -2.192425 -2.164617
H  1.699108 -3.21018 0.632137
H  1.932528 -2.28807 2.11906
H  1.247968 0.377372 1.70106
H  2.837835 -2.318516 -1.225086
H  3.731891 -0.393541 -2.487426
H  3.361352 1.905219 -1.690691
H  4.601059 2.351465 1.025618
H  1.374581 4.910972 -0.14112
H  6.147255 4.262783 0.937763
H  2.92916 6.83316 -0.212564
H  5.324362 6.513772 0.322468
totalener: -1117.84688529 hartree
nucrepener: 2190.52331256 hartree
electener: -3308.37019785 hartree
oneelecener: -5869.93120115 hartree
twoeener: 2561.56100330 hartree
kineticenergy: 1112.86440720 hartree
xcener: -110.232039941480 hartree
chargesum: -0.0000000
charge: -0.270373 -0.376260 -0.301092 0.112401 -0.025388 -0.105041 -0.241304 -0.271361 -0.194111 0.332924 -0.026158 -0.213050 -0.233423 0.067362 0.043258 -0.279975 -0.136646 0.242000 -0.105183 -0.165183 0.233558 -0.155187 -0.205870 -0.119231 -0.094699 -0.142566 0.104773 0.075388 0.094822 0.078030 0.085892 0.102607 0.090604 0.083848 0.086929 0.086940 0.082999 0.078093 0.083621 0.092430 0.080910 0.099867 0.108959 0.115075 0.108226 0.126072 0.133013 0.131670 0.123976 0.126203 0.124682 0.124968
qa: -0.2704 -0.3763 -0.3011 0.1124 -0.0254 -0.1050 -0.2413 -0.2714 -0.1941 0.3329 -0.0262 -0.2131 -0.2334 0.0674 0.0433 -0.2800 -0.1366 0.2420 -0.1052 -0.1652 0.2336 -0.1552 -0.2059 -0.1192 -0.0947 -0.1426 0.1048 0.0754 0.0948 0.0780 0.0859 0.1026 0.0906 0.0838 0.0869 0.0869 0.0830 0.0781 0.0836 0.0924 0.0809 0.0999 0.1090 0.1151 0.1082 0.1261 0.1330 0.1317 0.1240 0.1262 0.1247 0.1250
va: 2.1177 2.1302 2.0937 3.7174 3.8107 3.8778 3.9009 3.9071 3.8670 4.2739 3.7384 3.9409 3.9426 3.8579 3.6725 4.0513 3.9959 3.8136 3.9511 3.9506 3.8241 3.9372 4.0345 3.9488 3.9380 3.9578 1.0261 1.0372 1.0046 1.0078 1.0050 1.0194 1.0034 1.0024 1.0145 0.9971 0.9990 1.0108 1.0005 1.0006 1.0112 1.0106 0.9903 1.0323 1.0160 1.0007 1.0036 1.0046 1.0144 1.0000 0.9990 1.0004
dispcorr: -0.024226937 hartree
energy: -1117.871112223389
dipole: -30.61403 30.61245 -0.00158 -8.48440 8.80991 0.32550 -4.67664 4.83384 0.15720
magnitude: 0.36148 au
magnitude: 0.91881 debye
