program: Orca
programVersion: 5.0.2
elementType: O O O C C C C C C C C C C C C C C C C C C C C C C C H H H H H H H H H H H H H H H H H H H H H H H H H H
charge: 0
multiplicity: 1
keywords: wb97x-d3
keywords: def2-TZVPP
keywords: def2/J RIJCOSX
keywords: DEFGRID2
keywords: scfconv7
keywords: smallprint printgap noloewdin
keywords: NOSOSCF
formula: C23H26O3
InChI: InChI=1/C23H26O3/c1-16(2)13-20-21(23(20,3)4)22(24)25-15-17-9-8-12-19(14-17)26-18-10-6-5-7-11-18/h5-14,20-21H,15H2,1-4H3
52 atoms
O  0.220152 -2.600769 0.596023
O  -0.904517 -0.972938 1.642653
O  1.88291 2.656068 -0.435812
C  -3.461152 -2.454321 0.592765
C  -3.064237 -1.38825 -0.368618
C  -2.030808 -2.405522 0.092735
C  -4.272679 -3.625581 0.089351
C  -3.794403 -2.069832 2.013711
C  -3.498967 -1.360121 -1.787346
C  -0.888484 -1.904958 0.880557
C  -2.763446 -0.891622 -2.797551
C  -3.289305 -0.875136 -4.20102
C  -1.374336 -0.352888 -2.631929
C  1.466798 -2.033666 1.00244
C  1.889591 -0.981882 0.015138
C  1.728576 0.366482 0.305917
C  2.376962 -1.366366 -1.230547
C  2.066193 1.322908 -0.645413
C  2.700878 -0.406773 -2.174488
C  2.551161 0.941062 -1.887321
C  2.112159 3.191841 0.798802
C  1.183023 4.098895 1.28582
C  3.258554 2.896589 1.526289
C  1.407492 4.72021 2.50447
C  3.46602 3.518721 2.747283
C  2.545916 4.431888 3.241819
H  -2.926286 -0.411679 0.089458
H  -1.7710 -3.167381 -0.63267
H  -4.128431 -4.495067 0.732631
H  -4.003514 -3.917424 -0.925879
H  -5.338079 -3.386214 0.094251
H  -4.859649 -1.843508 2.091016
H  -3.241011 -1.199285 2.355419
H  -3.582451 -2.892627 2.699158
H  -4.500344 -1.722826 -2.002097
H  -4.296741 -1.284289 -4.267634
H  -2.645427 -1.455035 -4.867278
H  -3.312115 0.142133 -4.599618
H  -0.651715 -0.966399 -3.176593
H  -1.04562 -0.30158 -1.596458
H  -1.299508 0.654063 -3.049797
H  2.168579 -2.867586 1.003103
H  1.408768 -1.634256 2.015706
H  1.320956 0.664571 1.263611
H  2.4983 -2.417275 -1.462032
H  3.082431 -0.705549 -3.141915
H  2.805851 1.698101 -2.617251
H  0.294934 4.314368 0.706625
H  3.986093 2.193444 1.141256
H  0.681648 5.428768 2.881007
H  4.360576 3.291798 3.312179
H  2.716078 4.915699 4.194008
totalener: -1117.84600179 hartree
nucrepener: 2278.56944101 hartree
electener: -3396.41544280 hartree
oneelecener: -6046.11416452 hartree
twoeener: 2649.69872172 hartree
kineticenergy: 1112.85774273 hartree
xcener: -110.231138267641 hartree
chargesum: 0.0000000
charge: -0.262490 -0.395967 -0.301084 0.151064 -0.035095 -0.096909 -0.275544 -0.258259 -0.244065 0.324528 0.010255 -0.213386 -0.208697 0.051996 -0.028432 -0.095481 -0.184175 0.202272 -0.102027 -0.203576 0.232190 -0.199050 -0.151101 -0.093083 -0.117631 -0.140748 0.105665 0.082027 0.091016 0.083257 0.090797 0.080865 0.102292 0.083608 0.092623 0.078376 0.084247 0.086671 0.085237 0.065563 0.089342 0.108585 0.106772 0.132800 0.109245 0.124161 0.125094 0.123270 0.129036 0.124250 0.125158 0.124539
qa: -0.2625 -0.3960 -0.3011 0.1511 -0.0351 -0.0969 -0.2755 -0.2583 -0.2441 0.3245 0.0103 -0.2134 -0.2087 0.0520 -0.0284 -0.0955 -0.1842 0.2023 -0.1020 -0.2036 0.2322 -0.1990 -0.1511 -0.0931 -0.1176 -0.1407 0.1057 0.0820 0.0910 0.0833 0.0908 0.0809 0.1023 0.0836 0.0926 0.0784 0.0842 0.0867 0.0852 0.0656 0.0893 0.1086 0.1068 0.1328 0.1092 0.1242 0.1251 0.1233 0.1290 0.1243 0.1252 0.1245
va: 2.1180 2.0942 2.1022 3.7150 3.8387 3.8172 3.9117 3.8958 3.8958 4.2147 3.7565 3.9394 3.9459 3.8644 3.6983 3.8247 3.9893 3.8620 3.9265 4.0195 3.8294 4.0412 3.9454 3.9372 3.9495 3.9593 1.0269 1.0341 1.0065 1.0048 1.0009 1.0018 1.0225 1.0024 1.0103 1.0096 0.9987 0.9990 1.0023 1.0189 1.0028 0.9935 1.0139 1.0253 1.0122 0.9994 1.0128 1.0143 1.0054 0.9992 1.0002 1.0004
dispcorr: -0.026044906 hartree
energy: -1117.872046691765
dipole: -20.91817 21.12238 0.20421 -11.67728 11.27206 -0.40522 -8.19401 7.86237 -0.33164
magnitude: 0.56204 au
magnitude: 1.42858 debye
